incubator-any23-dev mailing list archives

Site index · List index
Message view « Date » · « Thread »
Top « Date » · « Thread »
From Simone Tripodi <simonetrip...@apache.org>
Subject Re: Any23PluginManagerTest failuers :S
Date Mon, 02 Jul 2012 06:43:00 GMT
OK I figured out that I previously installed plugins under
~/.any23/plugins that made tests failing... :P

thanks anyway,
-Simo

http://people.apache.org/~simonetripodi/
http://simonetripodi.livejournal.com/
http://twitter.com/simonetripodi
http://www.99soft.org/


On Sun, Jul 1, 2012 at 5:33 PM, Simone Tripodi <simonetripodi@apache.org> wrote:
> Hi all guys,
>
> looks like my local build stopped working again, I even dropped the
> local repo once again but without success... :S
>
> Follows below the error I get... does anyone have an idea of what
> happens? Once, fixed, I am ready to push the first release to be voted
>
> TIA and best,
> -Simo
>
> ~~~~~~~~~~~~~~~~~~~~~
>
> Test set: org.apache.any23.plugin.Any23PluginManagerTest
> -------------------------------------------------------------------------------
> Tests run: 2, Failures: 1, Errors: 0, Skipped: 0, Time elapsed: 0.004
> sec <<< FAILURE!
> testGetPlugins(org.apache.any23.plugin.Any23PluginManagerTest)  Time
> elapsed: 0.004 sec  <<< FAILURE!
> java.lang.AssertionError
>         at org.junit.Assert.fail(Assert.java:92)
>         at org.junit.Assert.assertTrue(Assert.java:43)
>         at org.junit.Assert.assertFalse(Assert.java:68)
>         at org.junit.Assert.assertFalse(Assert.java:79)
>         at org.apache.any23.plugin.Any23PluginManagerTest.testGetPlugins(Any23PluginManagerTest.java:66)
>         at sun.reflect.NativeMethodAccessorImpl.invoke0(Native Method)
>         at sun.reflect.NativeMethodAccessorImpl.invoke(NativeMethodAccessorImpl.java:39)
>         at sun.reflect.DelegatingMethodAccessorImpl.invoke(DelegatingMethodAccessorImpl.java:25)
>         at java.lang.reflect.Method.invoke(Method.java:597)
>         at org.junit.runners.model.FrameworkMethod$1.runReflectiveCall(FrameworkMethod.java:45)
>         at org.junit.internal.runners.model.ReflectiveCallable.run(ReflectiveCallable.java:15)
>         at org.junit.runners.model.FrameworkMethod.invokeExplosively(FrameworkMethod.java:42)
>         at org.junit.internal.runners.statements.InvokeMethod.evaluate(InvokeMethod.java:20)
>         at org.junit.internal.runners.statements.RunBefores.evaluate(RunBefores.java:28)
>         at org.junit.internal.runners.statements.RunAfters.evaluate(RunAfters.java:30)
>         at org.junit.runners.ParentRunner.runLeaf(ParentRunner.java:263)
>         at org.junit.runners.BlockJUnit4ClassRunner.runChild(BlockJUnit4ClassRunner.java:68)
>         at org.junit.runners.BlockJUnit4ClassRunner.runChild(BlockJUnit4ClassRunner.java:47)
>         at org.junit.runners.ParentRunner$3.run(ParentRunner.java:231)
>         at org.junit.runners.ParentRunner$1.schedule(ParentRunner.java:60)
>         at org.junit.runners.ParentRunner.runChildren(ParentRunner.java:229)
>         at org.junit.runners.ParentRunner.access$000(ParentRunner.java:50)
>         at org.junit.runners.ParentRunner$2.evaluate(ParentRunner.java:222)
>         at org.junit.runners.ParentRunner.run(ParentRunner.java:300)
>         at org.apache.maven.surefire.junit4.JUnit4TestSet.execute(JUnit4TestSet.java:53)
>         at org.apache.maven.surefire.junit4.JUnit4Provider.executeTestSet(JUnit4Provider.java:123)
>         at org.apache.maven.surefire.junit4.JUnit4Provider.invoke(JUnit4Provider.java:104)
>         at sun.reflect.NativeMethodAccessorImpl.invoke0(Native Method)
>         at sun.reflect.NativeMethodAccessorImpl.invoke(NativeMethodAccessorImpl.java:39)
>         at sun.reflect.DelegatingMethodAccessorImpl.invoke(DelegatingMethodAccessorImpl.java:25)
>         at java.lang.reflect.Method.invoke(Method.java:597)
>         at org.apache.maven.surefire.util.ReflectionUtils.invokeMethodWithArray(ReflectionUtils.java:164)
>         at org.apache.maven.surefire.booter.ProviderFactory$ProviderProxy.invoke(ProviderFactory.java:110)
>         at org.apache.maven.surefire.booter.SurefireStarter.invokeProvider(SurefireStarter.java:172)
>         at org.apache.maven.surefire.booter.SurefireStarter.runSuitesInProcessWhenForked(SurefireStarter.java:104)
>         at org.apache.maven.surefire.booter.ForkedBooter.main(ForkedBooter.java:70)
>
> http://people.apache.org/~simonetripodi/
> http://simonetripodi.livejournal.com/
> http://twitter.com/simonetripodi
> http://www.99soft.org/

Mime
View raw message