incubator-any23-dev mailing list archives

Site index · List index
Message view « Date » · « Thread »
Top « Date » · « Thread »
From Apache Jenkins Server <jenk...@builds.apache.org>
Subject Build failed in Jenkins: Any23-trunk » Apache Any23 :: Plugins :: Integration Test #251
Date Thu, 05 Jul 2012 07:10:37 GMT
See <https://builds.apache.org/job/Any23-trunk/org.apache.any23.plugins$any23-integration-test/251/changes>

Changes:

[simonetripodi] [maven-release-plugin] rollback the release of any23-0.7.0-incubating

[simonetripodi] [maven-release-plugin] prepare for next development iteration

[simonetripodi] [maven-release-plugin] prepare release any23-0.7.0-incubating

[simonetripodi] back to precious development version

------------------------------------------
projectStarted org.apache.any23.plugins:any23-integration-test:0.7.0-incubating-SNAPSHOT
[INFO]                                                                         
[INFO] ------------------------------------------------------------------------
[INFO] Building Apache Any23 :: Plugins :: Integration Test 0.7.0-incubating-SNAPSHOT
[INFO] ------------------------------------------------------------------------
mojoStarted org.codehaus.mojo:buildnumber-maven-plugin:1.0(default)
[INFO] 
[INFO] --- buildnumber-maven-plugin:1.0:create (default) @ any23-integration-test ---
[INFO] Checking for local modifications: skipped.
[INFO] Updating project files from SCM: skipped.
[INFO] Executing: /bin/sh -c cd <https://builds.apache.org/job/Any23-trunk/org.apache.any23.plugins$any23-integration-test/ws/>
&& svn --non-interactive info
[INFO] Working directory: <https://builds.apache.org/job/Any23-trunk/org.apache.any23.plugins$any23-integration-test/ws/>
[INFO] Storing buildNumber: 1357458 at timestamp: 1341472071068
[INFO] Executing: /bin/sh -c cd <https://builds.apache.org/job/Any23-trunk/org.apache.any23.plugins$any23-integration-test/ws/>
&& svn --non-interactive info
[INFO] Working directory: <https://builds.apache.org/job/Any23-trunk/org.apache.any23.plugins$any23-integration-test/ws/>
mojoSucceeded org.codehaus.mojo:buildnumber-maven-plugin:1.0(default)[INFO] Storing buildScmBranch:
trunk

mojoStarted org.apache.maven.plugins:maven-resources-plugin:2.5(default-resources)[debug]
execute contextualize
[INFO] Using 'UTF-8' encoding to copy filtered resources.
[INFO] Copying 3 resources to META-INF

[INFO] 
[INFO] --- maven-resources-plugin:2.5:resources (default-resources) @ any23-integration-test
---
mojoSucceeded org.apache.maven.plugins:maven-resources-plugin:2.5(default-resources)
mojoStarted org.apache.maven.plugins:maven-compiler-plugin:2.3.2(default-compile)
[INFO] Nothing to compile - all classes are up to date
[INFO] 
[INFO] --- maven-compiler-plugin:2.3.2:compile (default-compile) @ any23-integration-test
---
mojoSucceeded org.apache.maven.plugins:maven-compiler-plugin:2.3.2(default-compile)
mojoStarted org.apache.maven.plugins:maven-resources-plugin:2.5(default-testResources)[debug]
execute contextualize
[INFO] Using 'UTF-8' encoding to copy filtered resources.

[INFO] Copying 0 resource
[INFO] 
[INFO] --- maven-resources-plugin:2.5:testResources (default-testResources) @ any23-integration-test
---
mojoSucceeded org.apache.maven.plugins:maven-resources-plugin:2.5(default-testResources)
mojoStarted org.apache.maven.plugins:maven-compiler-plugin:2.3.2(default-testCompile)
[INFO] [INFO] Compiling 1 source file to <https://builds.apache.org/job/Any23-trunk/org.apache.any23.plugins$any23-integration-test/ws/target/test-classes>

[INFO] --- maven-compiler-plugin:2.3.2:testCompile (default-testCompile) @ any23-integration-test
---
mojoSucceeded org.apache.maven.plugins:maven-compiler-plugin:2.3.2(default-testCompile)
mojoStarted org.apache.maven.plugins:maven-surefire-plugin:2.4.3(default-test)
[INFO] 
[INFO] --- maven-surefire-plugin:2.4.3:test (default-test) @ any23-integration-test ---
[INFO] Surefire report directory: <https://builds.apache.org/job/Any23-trunk/org.apache.any23.plugins$any23-integration-test/ws/target/surefire-reports>

-------------------------------------------------------
 T E S T S
-------------------------------------------------------
There are no tests to run.

Results :

Tests run: 0, Failures: 0, Errors: 0, Skipped: 0

mojoSucceeded org.apache.maven.plugins:maven-surefire-plugin:2.4.3(default-test)
[JENKINS] Recording test results
mojoStarted org.apache.maven.plugins:maven-jar-plugin:2.3.1(default-jar)
[INFO] 
[INFO] --- maven-jar-plugin:2.3.1:jar (default-jar) @ any23-integration-test ---
[INFO] Building jar: <https://builds.apache.org/job/Any23-trunk/org.apache.any23.plugins$any23-integration-test/ws/target/any23-integration-test-0.7.0-incubating-SNAPSHOT.jar>
mojoSucceeded org.apache.maven.plugins:maven-jar-plugin:2.3.1(default-jar)
mojoStarted org.apache.maven.plugins:maven-site-plugin:3.0(attach-descriptor)
[INFO] 
[INFO] --- maven-site-plugin:3.0:attach-descriptor (attach-descriptor) @ any23-integration-test
---
mojoSucceeded org.apache.maven.plugins:maven-site-plugin:3.0(attach-descriptor)
mojoStarted org.apache.maven.plugins:maven-invoker-plugin:1.5(default)
[INFO] 
[INFO] --- maven-invoker-plugin:1.5:run (default) @ any23-integration-test ---
[INFO] Building: office-scraper/pom.xml
[INFO] ..SUCCESS (32.9 s)
[INFO] Building: html-scraper/pom.xml
[INFO] ..SUCCESS (20.9 s)
[INFO] Building: basic-crawler/pom.xml
mojoFailed org.apache.maven.plugins:maven-invoker-plugin:1.5(default)[INFO] ..FAILED (51.5
s)
[INFO]   The build exited with code 1. See <https://builds.apache.org/job/Any23-trunk/org.apache.any23.plugins$any23-integration-test/ws/target/plugins-build/basic-crawler/build.log>
for details.
[INFO] -------------------------------------------------
[INFO] Build Summary:
[INFO]   Passed: 2, Failed: 1, Errors: 0, Skipped: 0
[INFO] -------------------------------------------------
[ERROR] The following builds failed:
[ERROR] *  basic-crawler/pom.xml
[INFO] -------------------------------------------------

projectFailed org.apache.any23.plugins:any23-integration-test:0.7.0-incubating-SNAPSHOT

Mime
View raw message