incubator-any23-dev mailing list archives

Site index · List index
Message view « Date » · « Thread »
Top « Date » · « Thread »
From Apache Jenkins Server <jenk...@builds.apache.org>
Subject Build failed in Jenkins: Any23-trunk #249
Date Mon, 02 Jul 2012 07:22:33 GMT
See <https://builds.apache.org/job/Any23-trunk/249/>

------------------------------------------
[...truncated 5186 lines...]
<file://test2-workbook.xls/sheet/Sheet2/1/2/> <http://www.w3.org/1999/02/22-rdf-syntax-ns#type>
<http://vocab.sindice.net/excel/cell> .
<file://test2-workbook.xls/sheet/Sheet2/1/2/> <http://vocab.sindice.net/excel/cellValue>
"b 2.3"^^<http://vocab.sindice.net/excel/string> .
<file://test2-workbook.xls/sheet/Sheet2> <http://vocab.sindice.net/excel/containsRow>
<file://test2-workbook.xls/sheet/Sheet2/2> .
<file://test2-workbook.xls/sheet/Sheet2/2> <http://www.w3.org/1999/02/22-rdf-syntax-ns#type>
<http://vocab.sindice.net/excel/row> .
<file://test2-workbook.xls/sheet/Sheet2/2> <http://vocab.sindice.net/excel/firstCell>
"0"^^<http://www.w3.org/2001/XMLSchema#int> .
<file://test2-workbook.xls/sheet/Sheet2/2> <http://vocab.sindice.net/excel/lastCell>
"3"^^<http://www.w3.org/2001/XMLSchema#int> .
<file://test2-workbook.xls/sheet/Sheet2/2> <http://vocab.sindice.net/excel/containsCell>
<file://test2-workbook.xls/sheet/Sheet2/2/0/> .
<file://test2-workbook.xls/sheet/Sheet2/2/0/> <http://www.w3.org/1999/02/22-rdf-syntax-ns#type>
<http://vocab.sindice.net/excel/cell> .
<file://test2-workbook.xls/sheet/Sheet2/2/0/> <http://vocab.sindice.net/excel/cellValue>
"b 3.1"^^<http://vocab.sindice.net/excel/string> .
<file://test2-workbook.xls/sheet/Sheet2/2> <http://vocab.sindice.net/excel/containsCell>
<file://test2-workbook.xls/sheet/Sheet2/2/1/> .
<file://test2-workbook.xls/sheet/Sheet2/2/1/> <http://www.w3.org/1999/02/22-rdf-syntax-ns#type>
<http://vocab.sindice.net/excel/cell> .
<file://test2-workbook.xls/sheet/Sheet2/2/1/> <http://vocab.sindice.net/excel/cellValue>
"b 3.2"^^<http://vocab.sindice.net/excel/string> .
<file://test2-workbook.xls/sheet/Sheet2/2> <http://vocab.sindice.net/excel/containsCell>
<file://test2-workbook.xls/sheet/Sheet2/2/2/> .
<file://test2-workbook.xls/sheet/Sheet2/2/2/> <http://www.w3.org/1999/02/22-rdf-syntax-ns#type>
<http://vocab.sindice.net/excel/cell> .
<file://test2-workbook.xls/sheet/Sheet2/2/2/> <http://vocab.sindice.net/excel/cellValue>
"b 3.3"^^<http://vocab.sindice.net/excel/string> .

Tests run: 3, Failures: 0, Errors: 0, Skipped: 0, Time elapsed: 1.377 sec
Running org.apache.any23.plugin.officescraper.XSSFWorkbookTest
Tests run: 2, Failures: 0, Errors: 0, Skipped: 0, Time elapsed: 0.076 sec

Results :

Tests run: 5, Failures: 0, Errors: 0, Skipped: 0

mojoSucceeded org.apache.maven.plugins:maven-surefire-plugin:2.9(default-test)
[JENKINS] Recording test results
mojoStarted org.apache.maven.plugins:maven-jar-plugin:2.3.1(default-jar)
[INFO] [INFO] Building jar: <https://builds.apache.org/job/Any23-trunk/ws/plugins/office-scraper/target/any23-office-scraper-1.0.0-incubating-SNAPSHOT.jar>

[INFO] --- maven-jar-plugin:2.3.1:jar (default-jar) @ any23-office-scraper ---
mojoSucceeded org.apache.maven.plugins:maven-jar-plugin:2.3.1(default-jar)
mojoStarted org.apache.maven.plugins:maven-site-plugin:3.0(attach-descriptor)
[INFO] 
[INFO] --- maven-site-plugin:3.0:attach-descriptor (attach-descriptor) @ any23-office-scraper
---
mojoSucceeded org.apache.maven.plugins:maven-site-plugin:3.0(attach-descriptor)
mojoStarted org.apache.maven.plugins:maven-assembly-plugin:2.2.2(assembly)[INFO] Reading assembly
descriptor: <https://builds.apache.org/job/Any23-trunk/ws/plugins/office-scraper/src/main/assembly/bin.xml>

[INFO] 
[INFO] --- maven-assembly-plugin:2.2.2:single (assembly) @ any23-office-scraper ---
[INFO] Building tar : <https://builds.apache.org/job/Any23-trunk/ws/plugins/office-scraper/target/apache-any23-office-scraper-1.0.0-incubating-SNAPSHOT-bin.tar.gz>
[INFO] Building zip: <https://builds.apache.org/job/Any23-trunk/ws/plugins/office-scraper/target/apache-any23-office-scraper-1.0.0-incubating-SNAPSHOT-bin.zip>
mojoSucceeded org.apache.maven.plugins:maven-assembly-plugin:2.2.2(assembly)
mojoStarted org.apache.maven.plugins:maven-install-plugin:2.3.1(default-install)[INFO] Installing
<https://builds.apache.org/job/Any23-trunk/ws/plugins/office-scraper/target/any23-office-scraper-1.0.0-incubating-SNAPSHOT.jar>
to /home/hudson/hudson-slave/maven-repositories/1/org/apache/any23/plugins/any23-office-scraper/1.0.0-incubating-SNAPSHOT/any23-office-scraper-1.0.0-incubating-SNAPSHOT.jar
[INFO] Installing <https://builds.apache.org/job/Any23-trunk/ws/plugins/office-scraper/pom.xml>
to /home/hudson/hudson-slave/maven-repositories/1/org/apache/any23/plugins/any23-office-scraper/1.0.0-incubating-SNAPSHOT/any23-office-scraper-1.0.0-incubating-SNAPSHOT.pom
[INFO] Installing <https://builds.apache.org/job/Any23-trunk/ws/plugins/office-scraper/target/apache-any23-office-scraper-1.0.0-incubating-SNAPSHOT-bin.tar.gz>
to /home/hudson/hudson-slave/maven-repositories/1/org/apache/any23/plugins/any23-office-scraper/1.0.0-incubating-SNAPSHOT/any23-office-scraper-1.0.0-incubating-SNAPSHOT-bin.tar.gz
[INFO] Installing <https://builds.apache.org/job/Any23-trunk/ws/plugins/office-scraper/target/apache-any23-office-scraper-1.0.0-incubating-SNAPSHOT-bin.zip>
to /home/hudson/hudson-slave/maven-repositories/1/org/apache/any23/plugins/any23-office-scraper/1.0.0-incubating-SNAPSHOT/any23-office-scraper-1.0.0-incubating-SNAPSHOT-bin.zip

[INFO] 
[INFO] --- maven-install-plugin:2.3.1:install (default-install) @ any23-office-scraper ---
mojoSucceeded org.apache.maven.plugins:maven-install-plugin:2.3.1(default-install)
mojoStarted org.apache.maven.plugins:maven-deploy-plugin:2.5(default-deploy)Downloading: https://repository.apache.org/content/repositories/snapshots/org/apache/any23/plugins/any23-office-scraper/1.0.0-incubating-SNAPSHOT/maven-metadata.xml

[INFO] 
[INFO] --- maven-deploy-plugin:2.5:deploy (default-deploy) @ any23-office-scraper ---
Downloaded: https://repository.apache.org/content/repositories/snapshots/org/apache/any23/plugins/any23-office-scraper/1.0.0-incubating-SNAPSHOT/maven-metadata.xml
(2 KB at 2.9 KB/sec)
Uploading: https://repository.apache.org/content/repositories/snapshots/org/apache/any23/plugins/any23-office-scraper/1.0.0-incubating-SNAPSHOT/any23-office-scraper-1.0.0-incubating-20120702.071333-3.jar
Uploaded: https://repository.apache.org/content/repositories/snapshots/org/apache/any23/plugins/any23-office-scraper/1.0.0-incubating-SNAPSHOT/any23-office-scraper-1.0.0-incubating-20120702.071333-3.jar
(15 KB at 45.3 KB/sec)
Uploading: https://repository.apache.org/content/repositories/snapshots/org/apache/any23/plugins/any23-office-scraper/1.0.0-incubating-SNAPSHOT/any23-office-scraper-1.0.0-incubating-20120702.071333-3.pom
Uploaded: https://repository.apache.org/content/repositories/snapshots/org/apache/any23/plugins/any23-office-scraper/1.0.0-incubating-SNAPSHOT/any23-office-scraper-1.0.0-incubating-20120702.071333-3.pom
(4 KB at 16.3 KB/sec)
Downloading: https://repository.apache.org/content/repositories/snapshots/org/apache/any23/plugins/any23-office-scraper/maven-metadata.xml
Downloaded: https://repository.apache.org/content/repositories/snapshots/org/apache/any23/plugins/any23-office-scraper/maven-metadata.xml
(315 B at 0.6 KB/sec)
Uploading: https://repository.apache.org/content/repositories/snapshots/org/apache/any23/plugins/any23-office-scraper/1.0.0-incubating-SNAPSHOT/maven-metadata.xml
Uploaded: https://repository.apache.org/content/repositories/snapshots/org/apache/any23/plugins/any23-office-scraper/1.0.0-incubating-SNAPSHOT/maven-metadata.xml
(2 KB at 3.8 KB/sec)
Uploading: https://repository.apache.org/content/repositories/snapshots/org/apache/any23/plugins/any23-office-scraper/maven-metadata.xml
Uploaded: https://repository.apache.org/content/repositories/snapshots/org/apache/any23/plugins/any23-office-scraper/maven-metadata.xml
(315 B at 1.1 KB/sec)
Uploading: https://repository.apache.org/content/repositories/snapshots/org/apache/any23/plugins/any23-office-scraper/1.0.0-incubating-SNAPSHOT/any23-office-scraper-1.0.0-incubating-20120702.071333-3-bin.tar.gz
Uploaded: https://repository.apache.org/content/repositories/snapshots/org/apache/any23/plugins/any23-office-scraper/1.0.0-incubating-SNAPSHOT/any23-office-scraper-1.0.0-incubating-20120702.071333-3-bin.tar.gz
(1503 KB at 969.4 KB/sec)
Uploading: https://repository.apache.org/content/repositories/snapshots/org/apache/any23/plugins/any23-office-scraper/1.0.0-incubating-SNAPSHOT/maven-metadata.xml
Uploaded: https://repository.apache.org/content/repositories/snapshots/org/apache/any23/plugins/any23-office-scraper/1.0.0-incubating-SNAPSHOT/maven-metadata.xml
(2 KB at 1.7 KB/sec)
Uploading: https://repository.apache.org/content/repositories/snapshots/org/apache/any23/plugins/any23-office-scraper/1.0.0-incubating-SNAPSHOT/any23-office-scraper-1.0.0-incubating-20120702.071333-3-bin.zip
Uploaded: https://repository.apache.org/content/repositories/snapshots/org/apache/any23/plugins/any23-office-scraper/1.0.0-incubating-SNAPSHOT/any23-office-scraper-1.0.0-incubating-20120702.071333-3-bin.zip
(1504 KB at 1714.3 KB/sec)
Uploading: https://repository.apache.org/content/repositories/snapshots/org/apache/any23/plugins/any23-office-scraper/1.0.0-incubating-SNAPSHOT/maven-metadata.xml
Uploaded: https://repository.apache.org/content/repositories/snapshots/org/apache/any23/plugins/any23-office-scraper/1.0.0-incubating-SNAPSHOT/maven-metadata.xml
(2 KB at 6.3 KB/sec)
mojoSucceeded org.apache.maven.plugins:maven-deploy-plugin:2.5(default-deploy)
projectSucceeded org.apache.any23.plugins:any23-office-scraper:1.0.0-incubating-SNAPSHOT
projectStarted org.apache.any23.plugins:any23-integration-test:0.7.0-incubating-SNAPSHOT
[INFO]                                                                         
[INFO] ------------------------------------------------------------------------
[INFO] Building Apache Any23 :: Plugins :: Integration Test 0.7.0-incubating-SNAPSHOT
[INFO] ------------------------------------------------------------------------
[INFO] Checking for local modifications: skipped.
[INFO] Updating project files from SCM: skipped.
[INFO] Executing: /bin/sh -c cd <https://builds.apache.org/job/Any23-trunk/ws/plugins/integration-test>
&& svn --non-interactive info
[INFO] Working directory: <https://builds.apache.org/job/Any23-trunk/ws/plugins/integration-test>
[INFO] Storing buildNumber: 1355985 at timestamp: 1341213219195
[INFO] Executing: /bin/sh -c cd <https://builds.apache.org/job/Any23-trunk/ws/plugins/integration-test>
&& svn --non-interactive info
[INFO] Working directory: <https://builds.apache.org/job/Any23-trunk/ws/plugins/integration-test>
mojoStarted org.codehaus.mojo:buildnumber-maven-plugin:1.0(default)[INFO] Storing buildScmBranch:
trunk

[INFO] 
[INFO] --- buildnumber-maven-plugin:1.0:create (default) @ any23-integration-test ---
mojoSucceeded org.codehaus.mojo:buildnumber-maven-plugin:1.0(default)
[debug] execute contextualize
mojoStarted org.apache.maven.plugins:maven-resources-plugin:2.5(default-resources)[INFO] Using
'UTF-8' encoding to copy filtered resources.
[INFO] Copying 3 resources to META-INF

[INFO] 
[INFO] --- maven-resources-plugin:2.5:resources (default-resources) @ any23-integration-test
---
mojoSucceeded org.apache.maven.plugins:maven-resources-plugin:2.5(default-resources)
mojoStarted org.apache.maven.plugins:maven-compiler-plugin:2.3.2(default-compile)[INFO] Nothing
to compile - all classes are up to date

[INFO] 
[INFO] --- maven-compiler-plugin:2.3.2:compile (default-compile) @ any23-integration-test
---
mojoSucceeded org.apache.maven.plugins:maven-compiler-plugin:2.3.2(default-compile)
[debug] execute contextualize
mojoStarted org.apache.maven.plugins:maven-resources-plugin:2.5(default-testResources)[INFO]
Using 'UTF-8' encoding to copy filtered resources.
[INFO] Copying 0 resource

[INFO] 
[INFO] --- maven-resources-plugin:2.5:testResources (default-testResources) @ any23-integration-test
---
mojoSucceeded org.apache.maven.plugins:maven-resources-plugin:2.5(default-testResources)
mojoStarted org.apache.maven.plugins:maven-compiler-plugin:2.3.2(default-testCompile)[INFO]
Compiling 1 source file to <https://builds.apache.org/job/Any23-trunk/ws/plugins/integration-test/target/test-classes>

[INFO] 
[INFO] --- maven-compiler-plugin:2.3.2:testCompile (default-testCompile) @ any23-integration-test
---
mojoSucceeded org.apache.maven.plugins:maven-compiler-plugin:2.3.2(default-testCompile)
mojoStarted org.apache.maven.plugins:maven-surefire-plugin:2.4.3(default-test)
[INFO] 
[INFO] --- maven-surefire-plugin:2.4.3:test (default-test) @ any23-integration-test ---
[INFO] Surefire report directory: <https://builds.apache.org/job/Any23-trunk/ws/plugins/integration-test/target/surefire-reports>

-------------------------------------------------------
 T E S T S
-------------------------------------------------------
There are no tests to run.

Results :

Tests run: 0, Failures: 0, Errors: 0, Skipped: 0

mojoSucceeded org.apache.maven.plugins:maven-surefire-plugin:2.4.3(default-test)
[JENKINS] Recording test results
mojoStarted org.apache.maven.plugins:maven-jar-plugin:2.3.1(default-jar)
[INFO] [INFO] Building jar: <https://builds.apache.org/job/Any23-trunk/ws/plugins/integration-test/target/any23-integration-test-0.7.0-incubating-SNAPSHOT.jar>

[INFO] --- maven-jar-plugin:2.3.1:jar (default-jar) @ any23-integration-test ---
mojoSucceeded org.apache.maven.plugins:maven-jar-plugin:2.3.1(default-jar)
mojoStarted org.apache.maven.plugins:maven-site-plugin:3.0(attach-descriptor)
[INFO] 
[INFO] --- maven-site-plugin:3.0:attach-descriptor (attach-descriptor) @ any23-integration-test
---
mojoSucceeded org.apache.maven.plugins:maven-site-plugin:3.0(attach-descriptor)
mojoStarted org.apache.maven.plugins:maven-invoker-plugin:1.5(default)
[INFO] 
[INFO] --- maven-invoker-plugin:1.5:run (default) @ any23-integration-test ---
[INFO] Building: basic-crawler/pom.xml
[INFO] ..FAILED (37.0 s)
[INFO]   The build exited with code 1. See <https://builds.apache.org/job/Any23-trunk/ws/plugins/integration-test/target/plugins-build/basic-crawler/build.log>
for details.
[INFO] Building: office-scraper/pom.xml
[INFO] ..FAILED (9.1 s)
[INFO]   The build exited with code 1. See <https://builds.apache.org/job/Any23-trunk/ws/plugins/integration-test/target/plugins-build/office-scraper/build.log>
for details.
[INFO] Building: html-scraper/pom.xml
[INFO] ..FAILED (7.6 s)
[INFO]   The build exited with code 1. See <https://builds.apache.org/job/Any23-trunk/ws/plugins/integration-test/target/plugins-build/html-scraper/build.log>
for details.
[INFO] -------------------------------------------------
[INFO] Build Summary:
[INFO]   Passed: 0, Failed: 3, Errors: 0, Skipped: 0
[INFO] -------------------------------------------------
[ERROR] The following builds failed:
[ERROR] *  basic-crawler/pom.xml
[ERROR] *  office-scraper/pom.xml
[ERROR] *  html-scraper/pom.xml
[INFO] -------------------------------------------------
mojoFailed org.apache.maven.plugins:maven-invoker-plugin:1.5(default)
projectFailed org.apache.any23.plugins:any23-integration-test:0.7.0-incubating-SNAPSHOT
sessionEnded
[INFO] ------------------------------------------------------------------------
[INFO] Reactor Summary:
[INFO] 
[INFO] Apache Any23 ...................................... SUCCESS [34.780s]
[INFO] Apache Any23 :: Core .............................. SUCCESS [1:18.134s]
[INFO] Apache Any23 :: Plugins :: Basic Crawler .......... SUCCESS [48.584s]
[INFO] Apache Any23 :: Plugins :: HTML Scraper ........... SUCCESS [15.875s]
[INFO] Apache Any23 :: Plugins :: Office Scraper ......... SUCCESS [12.222s]
[INFO] Apache Any23 :: Plugins :: Integration Test ....... FAILURE [59.771s]
[INFO] Apache Any23 :: Service ........................... SKIPPED
[INFO] Apache Any23 :: Sources distribution module ....... SKIPPED
[INFO] ------------------------------------------------------------------------
[INFO] BUILD FAILURE
[INFO] ------------------------------------------------------------------------
[INFO] Total time: 4:12.047s
[INFO] Finished at: Mon Jul 02 07:14:38 UTC 2012
[INFO] Final Memory: 58M/151M
[INFO] ------------------------------------------------------------------------
Projects to build: [MavenProject: org.apache.any23:any23-parent:0.7.0-incubating-SNAPSHOT
@ <https://builds.apache.org/job/Any23-trunk/ws/pom.xml,> MavenProject: org.apache.any23:any23-core:0.7.0-incubating-SNAPSHOT
@ <https://builds.apache.org/job/Any23-trunk/ws/core/pom.xml,> MavenProject: org.apache.any23.plugins:any23-basic-crawler:1.0.0-incubating-SNAPSHOT
@ <https://builds.apache.org/job/Any23-trunk/ws/plugins/basic-crawler/pom.xml,> MavenProject:
org.apache.any23.plugins:any23-html-scraper:1.0.1-incubating-SNAPSHOT @ <https://builds.apache.org/job/Any23-trunk/ws/plugins/html-scraper/pom.xml,>
MavenProject: org.apache.any23.plugins:any23-office-scraper:1.0.0-incubating-SNAPSHOT @ <https://builds.apache.org/job/Any23-trunk/ws/plugins/office-scraper/pom.xml,>
MavenProject: org.apache.any23.plugins:any23-integration-test:0.7.0-incubating-SNAPSHOT @
<https://builds.apache.org/job/Any23-trunk/ws/plugins/integration-test/pom.xml,> MavenProject:
org.apache.any23:any23-service:0.7.0-incubating-SNAPSHOT @ <https://builds.apache.org/job/Any23-trunk/ws/service/pom.xml,>
MavenProject: org.apache.any23:any23-sources-dist:0.7.0-incubating-SNAPSHOT @ <https://builds.apache.org/job/Any23-trunk/ws/sources-dist/pom.xml]>
[JENKINS] Archiving <https://builds.apache.org/job/Any23-trunk/ws/plugins/html-scraper/pom.xml>
to /home/hudson/hudson/jobs/Any23-trunk/modules/org.apache.any23.plugins$any23-html-scraper/builds/2012-07-02_07-10-06/archive/org.apache.any23.plugins/any23-html-scraper/1.0.1-incubating-SNAPSHOT/any23-html-scraper-1.0.1-incubating-SNAPSHOT.pom
[JENKINS] Archiving <https://builds.apache.org/job/Any23-trunk/ws/plugins/html-scraper/target/any23-html-scraper-1.0.1-incubating-SNAPSHOT.jar>
to /home/hudson/hudson/jobs/Any23-trunk/modules/org.apache.any23.plugins$any23-html-scraper/builds/2012-07-02_07-10-06/archive/org.apache.any23.plugins/any23-html-scraper/1.0.1-incubating-20120702.071314-3/any23-html-scraper-1.0.1-incubating-20120702.071314-3.jar
[JENKINS] Archiving <https://builds.apache.org/job/Any23-trunk/ws/plugins/html-scraper/target/apache-any23-html-scraper-1.0.1-incubating-SNAPSHOT-bin.tar.gz>
to /home/hudson/hudson/jobs/Any23-trunk/modules/org.apache.any23.plugins$any23-html-scraper/builds/2012-07-02_07-10-06/archive/org.apache.any23.plugins/any23-html-scraper/1.0.1-incubating-20120702.071314-3/any23-html-scraper-1.0.1-incubating-20120702.071314-3-bin.tar.gz
[JENKINS] Archiving <https://builds.apache.org/job/Any23-trunk/ws/plugins/html-scraper/target/apache-any23-html-scraper-1.0.1-incubating-SNAPSHOT-bin.zip>
to /home/hudson/hudson/jobs/Any23-trunk/modules/org.apache.any23.plugins$any23-html-scraper/builds/2012-07-02_07-10-06/archive/org.apache.any23.plugins/any23-html-scraper/1.0.1-incubating-20120702.071314-3/any23-html-scraper-1.0.1-incubating-20120702.071314-3-bin.zip
[JENKINS] Archiving <https://builds.apache.org/job/Any23-trunk/ws/pom.xml> to /home/hudson/hudson/jobs/Any23-trunk/modules/org.apache.any23$any23-parent/builds/2012-07-02_07-10-06/archive/org.apache.any23/any23-parent/0.7.0-incubating-SNAPSHOT/any23-parent-0.7.0-incubating-SNAPSHOT.pom
[JENKINS] Archiving <https://builds.apache.org/job/Any23-trunk/ws/target/any23-parent-0.7.0-incubating-SNAPSHOT-site.xml>
to /home/hudson/hudson/jobs/Any23-trunk/modules/org.apache.any23$any23-parent/builds/2012-07-02_07-10-06/archive/org.apache.any23/any23-parent/0.7.0-incubating-20120702.071056-183/any23-parent-0.7.0-incubating-20120702.071056-183-site.xml
[JENKINS] Archiving <https://builds.apache.org/job/Any23-trunk/ws/sources-dist/pom.xml>
to /home/hudson/hudson/jobs/Any23-trunk/modules/org.apache.any23$any23-sources-dist/builds/2012-07-02_07-10-07/archive/org.apache.any23/any23-sources-dist/0.7.0-incubating-SNAPSHOT/any23-sources-dist-0.7.0-incubating-SNAPSHOT.pom
[JENKINS] Archiving <https://builds.apache.org/job/Any23-trunk/ws/plugins/office-scraper/pom.xml>
to /home/hudson/hudson/jobs/Any23-trunk/modules/org.apache.any23.plugins$any23-office-scraper/builds/2012-07-02_07-10-06/archive/org.apache.any23.plugins/any23-office-scraper/1.0.0-incubating-SNAPSHOT/any23-office-scraper-1.0.0-incubating-SNAPSHOT.pom
[JENKINS] Archiving <https://builds.apache.org/job/Any23-trunk/ws/plugins/office-scraper/target/any23-office-scraper-1.0.0-incubating-SNAPSHOT.jar>
to /home/hudson/hudson/jobs/Any23-trunk/modules/org.apache.any23.plugins$any23-office-scraper/builds/2012-07-02_07-10-06/archive/org.apache.any23.plugins/any23-office-scraper/1.0.0-incubating-20120702.071333-3/any23-office-scraper-1.0.0-incubating-20120702.071333-3.jar
[JENKINS] Archiving <https://builds.apache.org/job/Any23-trunk/ws/plugins/office-scraper/target/apache-any23-office-scraper-1.0.0-incubating-SNAPSHOT-bin.tar.gz>
to /home/hudson/hudson/jobs/Any23-trunk/modules/org.apache.any23.plugins$any23-office-scraper/builds/2012-07-02_07-10-06/archive/org.apache.any23.plugins/any23-office-scraper/1.0.0-incubating-20120702.071333-3/any23-office-scraper-1.0.0-incubating-20120702.071333-3-bin.tar.gz
[JENKINS] Archiving <https://builds.apache.org/job/Any23-trunk/ws/plugins/office-scraper/target/apache-any23-office-scraper-1.0.0-incubating-SNAPSHOT-bin.zip>
to /home/hudson/hudson/jobs/Any23-trunk/modules/org.apache.any23.plugins$any23-office-scraper/builds/2012-07-02_07-10-06/archive/org.apache.any23.plugins/any23-office-scraper/1.0.0-incubating-20120702.071333-3/any23-office-scraper-1.0.0-incubating-20120702.071333-3-bin.zip
[JENKINS] Archiving <https://builds.apache.org/job/Any23-trunk/ws/service/pom.xml> to
/home/hudson/hudson/jobs/Any23-trunk/modules/org.apache.any23$any23-service/builds/2012-07-02_07-10-07/archive/org.apache.any23/any23-service/0.7.0-incubating-SNAPSHOT/any23-service-0.7.0-incubating-SNAPSHOT.pom
[JENKINS] Archiving <https://builds.apache.org/job/Any23-trunk/ws/plugins/integration-test/pom.xml>
to /home/hudson/hudson/jobs/Any23-trunk/modules/org.apache.any23.plugins$any23-integration-test/builds/2012-07-02_07-10-07/archive/org.apache.any23.plugins/any23-integration-test/0.7.0-incubating-SNAPSHOT/any23-integration-test-0.7.0-incubating-SNAPSHOT.pom
[JENKINS] Archiving <https://builds.apache.org/job/Any23-trunk/ws/plugins/integration-test/target/any23-integration-test-0.7.0-incubating-SNAPSHOT.jar>
to /home/hudson/hudson/jobs/Any23-trunk/modules/org.apache.any23.plugins$any23-integration-test/builds/2012-07-02_07-10-07/archive/org.apache.any23.plugins/any23-integration-test/0.7.0-incubating-SNAPSHOT/any23-integration-test-0.7.0-incubating-SNAPSHOT.jar
[JENKINS] Archiving <https://builds.apache.org/job/Any23-trunk/ws/plugins/basic-crawler/pom.xml>
to /home/hudson/hudson/jobs/Any23-trunk/modules/org.apache.any23.plugins$any23-basic-crawler/builds/2012-07-02_07-10-06/archive/org.apache.any23.plugins/any23-basic-crawler/1.0.0-incubating-SNAPSHOT/any23-basic-crawler-1.0.0-incubating-SNAPSHOT.pom
[JENKINS] Archiving <https://builds.apache.org/job/Any23-trunk/ws/plugins/basic-crawler/target/any23-basic-crawler-1.0.0-incubating-SNAPSHOT.jar>
to /home/hudson/hudson/jobs/Any23-trunk/modules/org.apache.any23.plugins$any23-basic-crawler/builds/2012-07-02_07-10-06/archive/org.apache.any23.plugins/any23-basic-crawler/1.0.0-incubating-20120702.071259-3/any23-basic-crawler-1.0.0-incubating-20120702.071259-3.jar
[JENKINS] Archiving <https://builds.apache.org/job/Any23-trunk/ws/plugins/basic-crawler/target/apache-any23-basic-crawler-1.0.0-incubating-SNAPSHOT-bin.tar.gz>
to /home/hudson/hudson/jobs/Any23-trunk/modules/org.apache.any23.plugins$any23-basic-crawler/builds/2012-07-02_07-10-06/archive/org.apache.any23.plugins/any23-basic-crawler/1.0.0-incubating-20120702.071259-3/any23-basic-crawler-1.0.0-incubating-20120702.071259-3-bin.tar.gz
[JENKINS] Archiving <https://builds.apache.org/job/Any23-trunk/ws/plugins/basic-crawler/target/apache-any23-basic-crawler-1.0.0-incubating-SNAPSHOT-bin.zip>
to /home/hudson/hudson/jobs/Any23-trunk/modules/org.apache.any23.plugins$any23-basic-crawler/builds/2012-07-02_07-10-06/archive/org.apache.any23.plugins/any23-basic-crawler/1.0.0-incubating-20120702.071259-3/any23-basic-crawler-1.0.0-incubating-20120702.071259-3-bin.zip
[JENKINS] Archiving <https://builds.apache.org/job/Any23-trunk/ws/core/pom.xml> to /home/hudson/hudson/jobs/Any23-trunk/modules/org.apache.any23$any23-core/builds/2012-07-02_07-10-06/archive/org.apache.any23/any23-core/0.7.0-incubating-SNAPSHOT/any23-core-0.7.0-incubating-SNAPSHOT.pom
[JENKINS] Archiving <https://builds.apache.org/job/Any23-trunk/ws/core/target/any23-core-0.7.0-incubating-SNAPSHOT.jar>
to /home/hudson/hudson/jobs/Any23-trunk/modules/org.apache.any23$any23-core/builds/2012-07-02_07-10-06/archive/org.apache.any23/any23-core/0.7.0-incubating-20120702.071204-119/any23-core-0.7.0-incubating-20120702.071204-119.jar
[JENKINS] Archiving <https://builds.apache.org/job/Any23-trunk/ws/core/target/apache-any23-0.7.0-incubating-SNAPSHOT-bin.tar.gz>
to /home/hudson/hudson/jobs/Any23-trunk/modules/org.apache.any23$any23-core/builds/2012-07-02_07-10-06/archive/org.apache.any23/any23-core/0.7.0-incubating-20120702.071204-119/any23-core-0.7.0-incubating-20120702.071204-119-bin.tar.gz
[JENKINS] Archiving <https://builds.apache.org/job/Any23-trunk/ws/core/target/apache-any23-0.7.0-incubating-SNAPSHOT-bin.zip>
to /home/hudson/hudson/jobs/Any23-trunk/modules/org.apache.any23$any23-core/builds/2012-07-02_07-10-06/archive/org.apache.any23/any23-core/0.7.0-incubating-20120702.071204-119/any23-core-0.7.0-incubating-20120702.071204-119-bin.zip
Waiting for Jenkins to finish collecting data
mavenExecutionResult exceptions not empty
message : Failed to execute goal org.apache.maven.plugins:maven-invoker-plugin:1.5:run (default)
on project any23-integration-test: 3 builds failed.
cause : 3 builds failed.
Stack trace : 
org.apache.maven.lifecycle.LifecycleExecutionException: Failed to execute goal org.apache.maven.plugins:maven-invoker-plugin:1.5:run
(default) on project any23-integration-test: 3 builds failed.
	at org.apache.maven.lifecycle.internal.MojoExecutor.execute(MojoExecutor.java:213)
	at org.apache.maven.lifecycle.internal.MojoExecutor.execute(MojoExecutor.java:153)
	at org.apache.maven.lifecycle.internal.MojoExecutor.execute(MojoExecutor.java:145)
	at org.apache.maven.lifecycle.internal.LifecycleModuleBuilder.buildProject(LifecycleModuleBuilder.java:84)
	at org.apache.maven.lifecycle.internal.LifecycleModuleBuilder.buildProject(LifecycleModuleBuilder.java:59)
	at org.apache.maven.lifecycle.internal.LifecycleStarter.singleThreadedBuild(LifecycleStarter.java:183)
	at org.apache.maven.lifecycle.internal.LifecycleStarter.execute(LifecycleStarter.java:161)
	at org.apache.maven.DefaultMaven.doExecute(DefaultMaven.java:319)
	at org.apache.maven.DefaultMaven.execute(DefaultMaven.java:156)
	at org.jvnet.hudson.maven3.launcher.Maven3Launcher.main(Maven3Launcher.java:79)
	at sun.reflect.NativeMethodAccessorImpl.invoke0(Native Method)
	at sun.reflect.NativeMethodAccessorImpl.invoke(NativeMethodAccessorImpl.java:39)
	at sun.reflect.DelegatingMethodAccessorImpl.invoke(DelegatingMethodAccessorImpl.java:25)
	at java.lang.reflect.Method.invoke(Method.java:597)
	at org.codehaus.plexus.classworlds.launcher.Launcher.launchStandard(Launcher.java:329)
	at org.codehaus.plexus.classworlds.launcher.Launcher.launch(Launcher.java:239)
	at org.jvnet.hudson.maven3.agent.Maven3Main.launch(Maven3Main.java:158)
	at hudson.maven.Maven3Builder.call(Maven3Builder.java:98)
	at hudson.maven.Maven3Builder.call(Maven3Builder.java:64)
	at hudson.remoting.UserRequest.perform(UserRequest.java:118)
	at hudson.remoting.UserRequest.perform(UserRequest.java:48)
	at hudson.remoting.Request$2.run(Request.java:287)
	at hudson.remoting.InterceptingExecutorService$1.call(InterceptingExecutorService.java:72)
	at java.util.concurrent.FutureTask$Sync.innerRun(FutureTask.java:303)
	at java.util.concurrent.FutureTask.run(FutureTask.java:138)
	at java.util.concurrent.ThreadPoolExecutor$Worker.runTask(ThreadPoolExecutor.java:886)
	at java.util.concurrent.ThreadPoolExecutor$Worker.run(ThreadPoolExecutor.java:908)
	at java.lang.Thread.run(Thread.java:662)
Caused by: org.apache.maven.plugin.MojoFailureException: 3 builds failed.
	at org.apache.maven.plugin.invoker.InvokerSession.handleFailures(InvokerSession.java:263)
	at org.apache.maven.plugin.invoker.InvokerMojo.processResults(InvokerMojo.java:58)
	at org.apache.maven.plugin.invoker.AbstractInvokerMojo.execute(AbstractInvokerMojo.java:620)
	at org.apache.maven.plugin.DefaultBuildPluginManager.executeMojo(DefaultBuildPluginManager.java:101)
	at org.apache.maven.lifecycle.internal.MojoExecutor.execute(MojoExecutor.java:209)
	... 27 more
Sending e-mails to: any23-dev@incubator.apache.org
channel stopped

Mime
View raw message