incubator-any23-dev mailing list archives

Site index · List index
Message view « Date » · « Thread »
Top « Date » · « Thread »
From Michele Mostarda <michele.mosta...@gmail.com>
Subject Re: [jira] [Reopened] (ANY23-34) Plugin Integration Test Fails
Date Fri, 23 Mar 2012 16:49:54 GMT
On 22 March 2012 16:22, Simone Tripodi (Reopened) (JIRA) <jira@apache.org>wrote:

>
>     [
> https://issues.apache.org/jira/browse/ANY23-34?page=com.atlassian.jira.plugin.system.issuetabpanels:all-tabpanel]
>
> Simone Tripodi reopened ANY23-34:
> ---------------------------------
>
>
> yup it makes sense having it reopened until addresses.
>
> I'll try to take care of it tonight
>

Hi guys, I closed that issue because it was related to another bug,
but good to see it was reopened and addressed.

Getting in touch Simone to understand better how to address it.

The best.

Mic


>
> > Plugin Integration Test Fails
> > -----------------------------
> >
> >                 Key: ANY23-34
> >                 URL: https://issues.apache.org/jira/browse/ANY23-34
> >             Project: Apache Any23
> >          Issue Type: Bug
> >    Affects Versions: 0.7.0
> >            Reporter: Michele Mostarda
> >            Assignee: Simone Tripodi
> >             Fix For: 0.8.0
> >
> >
> > If performing mvn clean install the Plugin Integration Test module fails
> with the following message:
> > {code}
> > [INFO] --- maven-invoker-plugin:1.5:run (default) @
> any23-integration-test ---
> > [INFO] Building: basic-crawler/pom.xml
> > [INFO] ..FAILED (36.2 s)
> > [INFO]   The build exited with code 1. See
> /home/hudson/hudson-slave/workspace/Any23-trunk/plugins/integration-test/target/plugins-build/basic-crawler/build.log
> for details.
> > [INFO] Building: office-scraper/pom.xml
> > [INFO] ..FAILED (8.7 s)
> > [INFO]   The build exited with code 1. See
> /home/hudson/hudson-slave/workspace/Any23-trunk/plugins/integration-test/target/plugins-build/office-scraper/build.log
> for details.
> > [INFO] Building: html-scraper/pom.xml
> > [INFO] ..FAILED (7.5 s)
> > [INFO]   The build exited with code 1. See
> /home/hudson/hudson-slave/workspace/Any23-trunk/plugins/integration-test/target/plugins-build/html-scraper/build.log
> for details.
> > {code}
> > The content of
>  /home/hudson/hudson-slave/workspace/Any23-trunk/plugins/integration-test/target/plugins-build/*/build.log
> files report the following error:
> > {code}
> > [INFO]
> ------------------------------------------------------------------------
> > [INFO] BUILD FAILURE
> > [INFO]
> ------------------------------------------------------------------------
> > [INFO] Total time: 11.195s
> > [INFO] Finished at: Sun Jan 15 10:53:22 CET 2012
> > [INFO] Final Memory: 23M/81M
> > [INFO]
> ------------------------------------------------------------------------
> > [ERROR] Failed to execute goal
> org.apache.maven.plugins:maven-assembly-plugin:2.2.2:single (assembly) on
> project any23-office-scraper: Failed to create assembly: Error filtering
> file
> '<PATH/TO/TRUNK>/plugins/integration-test/target/plugins-build/office-scraper/./../../LICENSE.txt':
> <PATH/TO/TRUNK>/plugins/integration-test/target/plugins-build/office-scraper/./../../LICENSE.txt
> (No such file or directory) -> [Help 1]
> > {code}
>
> --
> This message is automatically generated by JIRA.
> If you think it was sent incorrectly, please contact your JIRA
> administrators:
> https://issues.apache.org/jira/secure/ContactAdministrators!default.jspa
> For more information on JIRA, see: http://www.atlassian.com/software/jira
>
>
>


-- 
Michele Mostarda
Senior Software Engineer
skype: michele.mostarda
twitter: micmos
mail: me@michelemostarda.com
site : http://www.michelemostarda.com

Mime
  • Unnamed multipart/alternative (inline, None, 0 bytes)
View raw message