incubator-any23-dev mailing list archives

Site index · List index
Message view « Date » · « Thread »
Top « Date » · « Thread »
From Apache Jenkins Server <jenk...@builds.apache.org>
Subject Build failed in Jenkins: Any23-trunk » Apache Any23 :: Parent #127
Date Thu, 08 Mar 2012 07:24:14 GMT
See <https://builds.apache.org/job/Any23-trunk/org.apache.any23$any23-parent/127/>

------------------------------------------
channel started
<===[JENKINS REMOTING CAPACITY]===>   Executing Maven:  -B -f <https://builds.apache.org/job/Any23-trunk/org.apache.any23$any23-parent/ws/pom.xml>
-Dmaven.repo.local=/export/home/hudson/hudson-slave/maven-repositories/0 --settings settings.xml
clean deploy
[INFO] Scanning for projects...
[INFO] Reactor build order: 
[INFO]   Apache Any23 :: Parent
[INFO]   Apache Any23 :: Core
[INFO]   Apache Any23 :: Plugins :: Basic Crawler
[INFO]   Apache Any23 :: Plugins :: HTML Scraper
[INFO]   Apache Any23 :: Plugins :: Office Scraper
[INFO]   Apache Any23 :: Plugins :: Integration Test
[INFO]   Apache Any23 :: Service
[INFO] ------------------------------------------------------------------------
[INFO] Building Apache Any23 :: Parent
[INFO]    task-segment: [clean, deploy]
[INFO] ------------------------------------------------------------------------
[INFO] [clean:clean {execution: default-clean}]
log4j:WARN No appenders could be found for logger (org.apache.commons.beanutils.converters.BooleanConverter).
log4j:WARN Please initialize the log4j system properly.
[INFO] [cobertura:clean {execution: default}]
[INFO] [buildnumber:create {execution: default}]
[INFO] Checking for local modifications: skipped.
[INFO] Updating project files from SCM: skipped.
[INFO] Executing: /bin/sh -c cd <https://builds.apache.org/job/Any23-trunk/org.apache.any23$any23-parent/ws/>
&& svn --non-interactive info
[INFO] Working directory: <https://builds.apache.org/job/Any23-trunk/org.apache.any23$any23-parent/ws/>
[INFO] Storing buildNumber: 1297498 at timestamp: 1331191405895
[INFO] Executing: /bin/sh -c cd <https://builds.apache.org/job/Any23-trunk/org.apache.any23$any23-parent/ws/>
&& svn --non-interactive info
[INFO] Working directory: <https://builds.apache.org/job/Any23-trunk/org.apache.any23$any23-parent/ws/>
[INFO] Storing buildScmBranch: trunk
[INFO] [remote-resources:process {execution: default}]
[INFO] [site:attach-descriptor {execution: default-attach-descriptor}]
[INFO] [install:install {execution: default-install}]
[INFO] Installing <https://builds.apache.org/job/Any23-trunk/org.apache.any23$any23-parent/ws/pom.xml>
to /export/home/hudson/hudson-slave/maven-repositories/0/org/apache/any23/any23-parent/0.7.0-incubating-SNAPSHOT/any23-parent-0.7.0-incubating-SNAPSHOT.pom
[INFO] Installing <https://builds.apache.org/job/Any23-trunk/org.apache.any23$any23-parent/ws/target/any23-parent-0.7.0-incubating-SNAPSHOT-site.xml>
to /export/home/hudson/hudson-slave/maven-repositories/0/org/apache/any23/any23-parent/0.7.0-incubating-SNAPSHOT/any23-parent-0.7.0-incubating-SNAPSHOT-site.xml
[INFO] [deploy:deploy {execution: default-deploy}]
[INFO] Retrieving previous build number from apache.snapshots.https
[WARNING] *** CHECKSUM FAILED - Checksum failed on download: local = 'e0cb46bc212601b62c1154471a7194d67e6b9f4e';
remote = '61d6161b34093c332a8a9a8b6b7c4f7ade08feff' - RETRYING
[WARNING] *** CHECKSUM FAILED - Checksum failed on download: local = 'e0cb46bc212601b62c1154471a7194d67e6b9f4e';
remote = '61d6161b34093c332a8a9a8b6b7c4f7ade08feff' - IGNORING
Uploading: https://repository.apache.org/content/repositories/snapshots/org/apache/any23/any23-parent/0.7.0-incubating-SNAPSHOT/any23-parent-0.7.0-incubating-20120308.072334-28.pom
[JENKINS] Archiving <https://builds.apache.org/job/Any23-trunk/org.apache.any23$any23-parent/ws/pom.xml>
to /home/hudson/hudson/jobs/Any23-trunk/modules/org.apache.any23$any23-parent/builds/2012-03-08_07-17-35/archive/org.apache.any23/any23-parent/0.7.0-incubating-SNAPSHOT/any23-parent-0.7.0-incubating-SNAPSHOT.pom
[JENKINS] Archiving /export/home/hudson/hudson-slave/maven-repositories/0/org/apache/any23/any23-parent/0.7.0-incubating-SNAPSHOT/any23-parent-0.7.0-incubating-SNAPSHOT.pom
to /home/hudson/hudson/jobs/Any23-trunk/modules/org.apache.any23$any23-parent/builds/2012-03-08_07-17-35/archive/org.apache.any23/any23-parent/0.7.0-incubating-20120308.072334-28/any23-parent-0.7.0-incubating-20120308.072334-28.pom
[JENKINS] Archiving <https://builds.apache.org/job/Any23-trunk/org.apache.any23$any23-parent/ws/target/any23-parent-0.7.0-incubating-SNAPSHOT-site.xml>
to /home/hudson/hudson/jobs/Any23-trunk/modules/org.apache.any23$any23-parent/builds/2012-03-08_07-17-35/archive/org.apache.any23/any23-parent/0.7.0-incubating-20120308.072334-28/any23-parent-0.7.0-incubating-20120308.072334-28-site.xml
[INFO] ------------------------------------------------------------------------
[ERROR] BUILD ERROR
[INFO] ------------------------------------------------------------------------
[INFO] Error deploying artifact: Failed to transfer file: https://repository.apache.org/content/repositories/snapshots/org/apache/any23/any23-parent/0.7.0-incubating-SNAPSHOT/any23-parent-0.7.0-incubating-20120308.072334-28.pom.
Return code is: 401

[INFO] ------------------------------------------------------------------------
[INFO] For more information, run Maven with the -e switch
[INFO] ------------------------------------------------------------------------
[INFO] Total time: 2 minutes 5 seconds
[INFO] Finished at: Thu Mar 08 07:24:09 GMT+00:00 2012
[INFO] Final Memory: 44M/327M
[INFO] ------------------------------------------------------------------------


Mime
View raw message