incubator-any23-dev mailing list archives

Site index · List index
Message view « Date » · « Thread »
Top « Date » · « Thread »
From Apache Jenkins Server <jenk...@builds.apache.org>
Subject Build failed in Jenkins: Any23-trunk » Apache Any23 :: Parent #125
Date Tue, 06 Mar 2012 13:33:29 GMT
See <https://builds.apache.org/job/Any23-trunk/org.apache.any23$any23-parent/125/>

------------------------------------------
<===[JENKINS REMOTING CAPACITY]===>channel started
   Executing Maven:  -B -f <https://builds.apache.org/job/Any23-trunk/org.apache.any23$any23-parent/ws/pom.xml>
-Dmaven.repo.local=/home/hudson/hudson-slave/maven-repositories/0 --settings settings.xml
clean deploy
[INFO] Scanning for projects...
[INFO] ------------------------------------------------------------------------
[INFO] Reactor Build Order:
[INFO] 
[INFO] Apache Any23 :: Parent
[INFO] Apache Any23 :: Core
[INFO] Apache Any23 :: Plugins :: Basic Crawler
[INFO] Apache Any23 :: Plugins :: HTML Scraper
[INFO] Apache Any23 :: Plugins :: Office Scraper
[INFO] Apache Any23 :: Plugins :: Integration Test
[INFO] Apache Any23 :: Service
[INFO]                                                                         
[INFO] ------------------------------------------------------------------------
[INFO] Building Apache Any23 :: Parent 0.7.0-incubating-SNAPSHOT
[INFO] ------------------------------------------------------------------------
Downloading: http://repo1.maven.org/maven2/org/codehaus/mojo/cobertura-maven-plugin/2.0/cobertura-maven-plugin-2.0.pom
Downloaded: http://repo1.maven.org/maven2/org/codehaus/mojo/cobertura-maven-plugin/2.0/cobertura-maven-plugin-2.0.pom
(4 KB at 8.9 KB/sec)
Downloading: http://repo1.maven.org/maven2/org/codehaus/mojo/cobertura-maven-plugin/2.0/cobertura-maven-plugin-2.0.jar
Downloaded: http://repo1.maven.org/maven2/org/codehaus/mojo/cobertura-maven-plugin/2.0/cobertura-maven-plugin-2.0.jar
(26 KB at 57.9 KB/sec)
[INFO] 
[INFO] --- maven-clean-plugin:2.4.1:clean (default-clean) @ any23-parent ---
log4j:WARN No appenders could be found for logger (org.apache.commons.beanutils.converters.BooleanConverter).
log4j:WARN Please initialize the log4j system properly.
[INFO] Downloading: http://repo1.maven.org/maven2/cobertura/cobertura/1.7/cobertura-1.7.pom

[INFO] --- cobertura-maven-plugin:2.0:clean (default) @ any23-parent ---
Downloaded: http://repo1.maven.org/maven2/cobertura/cobertura/1.7/cobertura-1.7.pom (854 B
at 2.2 KB/sec)
Downloading: http://repo1.maven.org/maven2/asm/asm/2.1/asm-2.1.pom
Downloaded: http://repo1.maven.org/maven2/asm/asm/2.1/asm-2.1.pom (807 B at 1.6 KB/sec)
Downloading: http://repo1.maven.org/maven2/javancss/ccl/21.41/ccl-21.41.pom
Downloaded: http://repo1.maven.org/maven2/javancss/ccl/21.41/ccl-21.41.pom (145 B at 0.3 KB/sec)
Downloading: http://repo1.maven.org/maven2/javancss/javancss/21.41/javancss-21.41.pom
Downloaded: http://repo1.maven.org/maven2/javancss/javancss/21.41/javancss-21.41.pom (150
B at 0.3 KB/sec)
Downloading: http://repo1.maven.org/maven2/cobertura/cobertura-runtime/1.7/cobertura-runtime-1.7.pom
Downloaded: http://repo1.maven.org/maven2/cobertura/cobertura-runtime/1.7/cobertura-runtime-1.7.pom
(2 KB at 2.7 KB/sec)
Downloading: http://repo1.maven.org/maven2/cobertura/cobertura/1.7/cobertura-1.7.jar
Downloading: http://repo1.maven.org/maven2/asm/asm/2.1/asm-2.1.jar
Downloading: http://repo1.maven.org/maven2/javancss/ccl/21.41/ccl-21.41.jar
Downloading: http://repo1.maven.org/maven2/javancss/javancss/21.41/javancss-21.41.jar
Downloaded: http://repo1.maven.org/maven2/asm/asm/2.1/asm-2.1.jar (33 KB at 31.1 KB/sec)
Downloaded: http://repo1.maven.org/maven2/cobertura/cobertura/1.7/cobertura-1.7.jar (92 KB
at 69.3 KB/sec)
Downloaded: http://repo1.maven.org/maven2/javancss/ccl/21.41/ccl-21.41.jar (326 KB at 206.7
KB/sec)
Downloaded: http://repo1.maven.org/maven2/javancss/javancss/21.41/javancss-21.41.jar (101
KB at 55.4 KB/sec)
[INFO] 
[INFO] --- buildnumber-maven-plugin:1.0:create (default) @ any23-parent ---
[INFO] Checking for local modifications: skipped.
[INFO] Updating project files from SCM: skipped.
[INFO] Executing: /bin/sh -c cd <https://builds.apache.org/job/Any23-trunk/org.apache.any23$any23-parent/ws/>
&& svn --non-interactive info
[INFO] Working directory: <https://builds.apache.org/job/Any23-trunk/org.apache.any23$any23-parent/ws/>
[INFO] Storing buildNumber: 1297469 at timestamp: 1331040799812
[INFO] Executing: /bin/sh -c cd <https://builds.apache.org/job/Any23-trunk/org.apache.any23$any23-parent/ws/>
&& svn --non-interactive info
[INFO] Working directory: <https://builds.apache.org/job/Any23-trunk/org.apache.any23$any23-parent/ws/>
[INFO] Storing buildScmBranch: trunk
[INFO] 
[INFO] --- maven-remote-resources-plugin:1.2.1:process (default) @ any23-parent ---
Downloading: http://repo.aduna-software.org/maven2/releases/org/kohsuke/metainf-services/metainf-services/1.3/metainf-services-1.3.pom
Downloading: http://repo1.maven.org/maven2/org/kohsuke/metainf-services/metainf-services/1.3/metainf-services-1.3.pom
Downloaded: http://repo1.maven.org/maven2/org/kohsuke/metainf-services/metainf-services/1.3/metainf-services-1.3.pom
(4 KB at 10.4 KB/sec)
Downloading: http://repo.aduna-software.org/maven2/releases/org/kohsuke/metainf-services/metainf-services/1.3/metainf-services-1.3.jar
Downloading: http://repo1.maven.org/maven2/org/kohsuke/metainf-services/metainf-services/1.3/metainf-services-1.3.jar
Downloaded: http://repo1.maven.org/maven2/org/kohsuke/metainf-services/metainf-services/1.3/metainf-services-1.3.jar
(7 KB at 22.2 KB/sec)
Downloading: http://repo1.maven.org/maven2/org/jvnet/wagon-svn/wagon-svn/1.12/wagon-svn-1.12.pom
[INFO] 
[INFO] --- maven-site-plugin:3.0:attach-descriptor (attach-descriptor) @ any23-parent ---
Downloaded: http://repo1.maven.org/maven2/org/jvnet/wagon-svn/wagon-svn/1.12/wagon-svn-1.12.pom
(3 KB at 6.9 KB/sec)
Downloading: http://repo1.maven.org/maven2/org/jvnet/wagon-svn/wagon-svn/1.12/wagon-svn-1.12.jar
Downloaded: http://repo1.maven.org/maven2/org/jvnet/wagon-svn/wagon-svn/1.12/wagon-svn-1.12.jar
(20 KB at 63.1 KB/sec)
[INFO] [INFO] Installing <https://builds.apache.org/job/Any23-trunk/org.apache.any23$any23-parent/ws/pom.xml>
to /home/hudson/hudson-slave/maven-repositories/0/org/apache/any23/any23-parent/0.7.0-incubating-SNAPSHOT/any23-parent-0.7.0-incubating-SNAPSHOT.pom

[INFO] --- maven-install-plugin:2.3.1:install (default-install) @ any23-parent ---
[INFO] Installing <https://builds.apache.org/job/Any23-trunk/org.apache.any23$any23-parent/ws/target/any23-parent-0.7.0-incubating-SNAPSHOT-site.xml>
to /home/hudson/hudson-slave/maven-repositories/0/org/apache/any23/any23-parent/0.7.0-incubating-SNAPSHOT/any23-parent-0.7.0-incubating-SNAPSHOT-site.xml
[INFO] Downloading: https://repository.apache.org/content/repositories/snapshots/org/apache/any23/any23-parent/0.7.0-incubating-SNAPSHOT/maven-metadata.xml

[INFO] --- maven-deploy-plugin:2.5:deploy (default-deploy) @ any23-parent ---
Downloaded: https://repository.apache.org/content/repositories/snapshots/org/apache/any23/any23-parent/0.7.0-incubating-SNAPSHOT/maven-metadata.xml
(852 B at 1.2 KB/sec)
Uploading: https://repository.apache.org/content/repositories/snapshots/org/apache/any23/any23-parent/0.7.0-incubating-SNAPSHOT/any23-parent-0.7.0-incubating-20120306.133324-28.pom
[JENKINS] Archiving <https://builds.apache.org/job/Any23-trunk/org.apache.any23$any23-parent/ws/pom.xml>
to /home/hudson/hudson/jobs/Any23-trunk/modules/org.apache.any23$any23-parent/builds/2012-03-06_13-32-34/archive/org.apache.any23/any23-parent/0.7.0-incubating-SNAPSHOT/any23-parent-0.7.0-incubating-SNAPSHOT.pom
[JENKINS] Archiving <https://builds.apache.org/job/Any23-trunk/org.apache.any23$any23-parent/ws/target/any23-parent-0.7.0-incubating-SNAPSHOT-site.xml>
to /home/hudson/hudson/jobs/Any23-trunk/modules/org.apache.any23$any23-parent/builds/2012-03-06_13-32-34/archive/org.apache.any23/any23-parent/0.7.0-incubating-SNAPSHOT/any23-parent-0.7.0-incubating-SNAPSHOT-site.xml
[INFO] ------------------------------------------------------------------------
[INFO] Reactor Summary:
[INFO] 
[INFO] Apache Any23 :: Parent ............................ FAILURE [37.375s]
[INFO] Apache Any23 :: Core .............................. SKIPPED
[INFO] Apache Any23 :: Plugins :: Basic Crawler .......... SKIPPED
[INFO] Apache Any23 :: Plugins :: HTML Scraper ........... SKIPPED
[INFO] Apache Any23 :: Plugins :: Office Scraper ......... SKIPPED
[INFO] Apache Any23 :: Plugins :: Integration Test ....... SKIPPED
[INFO] Apache Any23 :: Service ........................... SKIPPED
[INFO] ------------------------------------------------------------------------
[INFO] BUILD FAILURE
[INFO] ------------------------------------------------------------------------
[INFO] Total time: 42.095s
[INFO] Finished at: Tue Mar 06 13:33:29 UTC 2012
[INFO] Final Memory: 13M/80M
[INFO] ------------------------------------------------------------------------
mavenExecutionResult exceptions not empty
message : Failed to execute goal org.apache.maven.plugins:maven-deploy-plugin:2.5:deploy (default-deploy)
on project any23-parent: Failed to deploy artifacts: Could not transfer artifact org.apache.any23:any23-parent:pom:0.7.0-incubating-20120306.133324-28
from/to apache.snapshots.https (https://repository.apache.org/content/repositories/snapshots):
Failed to transfer file: https://repository.apache.org/content/repositories/snapshots/org/apache/any23/any23-parent/0.7.0-incubating-SNAPSHOT/any23-parent-0.7.0-incubating-20120306.133324-28.pom.
Return code is: 401
cause : Failed to deploy artifacts: Could not transfer artifact org.apache.any23:any23-parent:pom:0.7.0-incubating-20120306.133324-28
from/to apache.snapshots.https (https://repository.apache.org/content/repositories/snapshots):
Failed to transfer file: https://repository.apache.org/content/repositories/snapshots/org/apache/any23/any23-parent/0.7.0-incubating-SNAPSHOT/any23-parent-0.7.0-incubating-20120306.133324-28.pom.
Return code is: 401
Stack trace : 
org.apache.maven.lifecycle.LifecycleExecutionException: Failed to execute goal org.apache.maven.plugins:maven-deploy-plugin:2.5:deploy
(default-deploy) on project any23-parent: Failed to deploy artifacts: Could not transfer artifact
org.apache.any23:any23-parent:pom:0.7.0-incubating-20120306.133324-28 from/to apache.snapshots.https
(https://repository.apache.org/content/repositories/snapshots): Failed to transfer file: https://repository.apache.org/content/repositories/snapshots/org/apache/any23/any23-parent/0.7.0-incubating-SNAPSHOT/any23-parent-0.7.0-incubating-20120306.133324-28.pom.
Return code is: 401
	at org.apache.maven.lifecycle.internal.MojoExecutor.execute(MojoExecutor.java:217)
	at org.apache.maven.lifecycle.internal.MojoExecutor.execute(MojoExecutor.java:153)
	at org.apache.maven.lifecycle.internal.MojoExecutor.execute(MojoExecutor.java:145)
	at org.apache.maven.lifecycle.internal.LifecycleModuleBuilder.buildProject(LifecycleModuleBuilder.java:84)
	at org.apache.maven.lifecycle.internal.LifecycleModuleBuilder.buildProject(LifecycleModuleBuilder.java:59)
	at org.apache.maven.lifecycle.internal.LifecycleStarter.singleThreadedBuild(LifecycleStarter.java:183)
	at org.apache.maven.lifecycle.internal.LifecycleStarter.execute(LifecycleStarter.java:161)
	at org.apache.maven.DefaultMaven.doExecute(DefaultMaven.java:319)
	at org.apache.maven.DefaultMaven.execute(DefaultMaven.java:156)
	at org.jvnet.hudson.maven3.launcher.Maven3Launcher.main(Maven3Launcher.java:79)
	at sun.reflect.NativeMethodAccessorImpl.invoke0(Native Method)
	at sun.reflect.NativeMethodAccessorImpl.invoke(NativeMethodAccessorImpl.java:39)
	at sun.reflect.DelegatingMethodAccessorImpl.invoke(DelegatingMethodAccessorImpl.java:25)
	at java.lang.reflect.Method.invoke(Method.java:597)
	at org.codehaus.plexus.classworlds.launcher.Launcher.launchStandard(Launcher.java:329)
	at org.codehaus.plexus.classworlds.launcher.Launcher.launch(Launcher.java:239)
	at org.jvnet.hudson.maven3.agent.Maven3Main.launch(Maven3Main.java:158)
	at hudson.maven.Maven3Builder.call(Maven3Builder.java:104)
	at hudson.maven.Maven3Builder.call(Maven3Builder.java:70)
	at hudson.remoting.UserRequest.perform(UserRequest.java:118)
	at hudson.remoting.UserRequest.perform(UserRequest.java:48)
	at hudson.remoting.Request$2.run(Request.java:287)
	at hudson.remoting.InterceptingExecutorService$1.call(InterceptingExecutorService.java:72)
	at java.util.concurrent.FutureTask$Sync.innerRun(FutureTask.java:303)
	at java.util.concurrent.FutureTask.run(FutureTask.java:138)
	at java.util.concurrent.ThreadPoolExecutor$Worker.runTask(ThreadPoolExecutor.java:886)
	at java.util.concurrent.ThreadPoolExecutor$Worker.run(ThreadPoolExecutor.java:908)
	at java.lang.Thread.run(Thread.java:662)
Caused by: org.apache.maven.plugin.MojoExecutionException: Failed to deploy artifacts: Could
not transfer artifact org.apache.any23:any23-parent:pom:0.7.0-incubating-20120306.133324-28
from/to apache.snapshots.https (https://repository.apache.org/content/repositories/snapshots):
Failed to transfer file: https://repository.apache.org/content/repositories/snapshots/org/apache/any23/any23-parent/0.7.0-incubating-SNAPSHOT/any23-parent-0.7.0-incubating-20120306.133324-28.pom.
Return code is: 401
	at org.apache.maven.plugin.deploy.DeployMojo.execute(DeployMojo.java:189)
	at org.apache.maven.plugin.DefaultBuildPluginManager.executeMojo(DefaultBuildPluginManager.java:101)
	at org.apache.maven.lifecycle.internal.MojoExecutor.execute(MojoExecutor.java:209)
	... 27 more
Caused by: org.apache.maven.artifact.deployer.ArtifactDeploymentException: Failed to deploy
artifacts: Could not transfer artifact org.apache.any23:any23-parent:pom:0.7.0-incubating-20120306.133324-28
from/to apache.snapshots.https (https://repository.apache.org/content/repositories/snapshots):
Failed to transfer file: https://repository.apache.org/content/repositories/snapshots/org/apache/any23/any23-parent/0.7.0-incubating-SNAPSHOT/any23-parent-0.7.0-incubating-20120306.133324-28.pom.
Return code is: 401
	at org.apache.maven.artifact.deployer.DefaultArtifactDeployer.deploy(DefaultArtifactDeployer.java:141)
	at org.apache.maven.plugin.deploy.DeployMojo.execute(DeployMojo.java:148)
	... 29 more
Caused by: org.sonatype.aether.deployment.DeploymentException: Failed to deploy artifacts:
Could not transfer artifact org.apache.any23:any23-parent:pom:0.7.0-incubating-20120306.133324-28
from/to apache.snapshots.https (https://repository.apache.org/content/repositories/snapshots):
Failed to transfer file: https://repository.apache.org/content/repositories/snapshots/org/apache/any23/any23-parent/0.7.0-incubating-SNAPSHOT/any23-parent-0.7.0-incubating-20120306.133324-28.pom.
Return code is: 401
	at org.sonatype.aether.impl.internal.DefaultDeployer.deploy(DefaultDeployer.java:284)
	at org.sonatype.aether.impl.internal.DefaultDeployer.deploy(DefaultDeployer.java:215)
	at org.sonatype.aether.impl.internal.DefaultRepositorySystem.deploy(DefaultRepositorySystem.java:480)
	at org.apache.maven.artifact.deployer.DefaultArtifactDeployer.deploy(DefaultArtifactDeployer.java:137)
	... 30 more
Caused by: org.sonatype.aether.transfer.ArtifactTransferException: Could not transfer artifact
org.apache.any23:any23-parent:pom:0.7.0-incubating-20120306.133324-28 from/to apache.snapshots.https
(https://repository.apache.org/content/repositories/snapshots): Failed to transfer file: https://repository.apache.org/content/repositories/snapshots/org/apache/any23/any23-parent/0.7.0-incubating-SNAPSHOT/any23-parent-0.7.0-incubating-20120306.133324-28.pom.
Return code is: 401
	at org.sonatype.aether.connector.wagon.WagonRepositoryConnector$4.wrap(WagonRepositoryConnector.java:949)
	at org.sonatype.aether.connector.wagon.WagonRepositoryConnector$4.wrap(WagonRepositoryConnector.java:940)
	at org.sonatype.aether.connector.wagon.WagonRepositoryConnector$PutTask.flush(WagonRepositoryConnector.java:864)
	at org.sonatype.aether.connector.wagon.WagonRepositoryConnector.put(WagonRepositoryConnector.java:466)
	at org.sonatype.aether.impl.internal.DefaultDeployer.deploy(DefaultDeployer.java:278)
	... 33 more
Caused by: org.apache.maven.wagon.TransferFailedException: Failed to transfer file: https://repository.apache.org/content/repositories/snapshots/org/apache/any23/any23-parent/0.7.0-incubating-SNAPSHOT/any23-parent-0.7.0-incubating-20120306.133324-28.pom.
Return code is: 401
	at org.apache.maven.wagon.providers.http.LightweightHttpWagon.finishPutTransfer(LightweightHttpWagon.java:205)
	at org.apache.maven.wagon.AbstractWagon.putTransfer(AbstractWagon.java:413)
	at org.apache.maven.wagon.AbstractWagon.transfer(AbstractWagon.java:392)
	at org.apache.maven.wagon.AbstractWagon.putTransfer(AbstractWagon.java:365)
	at org.apache.maven.wagon.StreamWagon.put(StreamWagon.java:163)
	at org.sonatype.aether.connector.wagon.WagonRepositoryConnector$PutTask.run(WagonRepositoryConnector.java:825)
	at org.sonatype.aether.connector.wagon.WagonRepositoryConnector.put(WagonRepositoryConnector.java:465)
	... 34 more


Mime
View raw message