incubator-any23-dev mailing list archives

Site index · List index
Message view « Date » · « Thread »
Top « Date » · « Thread »
From Apache Jenkins Server <jenk...@builds.apache.org>
Subject Build failed in Jenkins: Any23-trunk #124
Date Tue, 06 Mar 2012 07:04:14 GMT
See <https://builds.apache.org/job/Any23-trunk/124/>

------------------------------------------
[...truncated 859 lines...]
A         core/src/main/resources/org/apache
A         core/src/main/resources/org/apache/any23
A         core/src/main/resources/org/apache/any23/prefixes
AU        core/src/main/resources/org/apache/any23/prefixes/prefixes.properties
A         core/src/main/resources/org/apache/any23/mime
A         core/src/main/resources/org/apache/any23/mime/tika-config.xml
A         core/src/main/resources/org/apache/any23/mime/mimetypes.xml
A         core/src/main/resources/org/apache/any23/extractor
A         core/src/main/resources/org/apache/any23/extractor/microdata
A         core/src/main/resources/org/apache/any23/extractor/microdata/example-microdata.html
A         core/src/main/resources/org/apache/any23/extractor/html
A         core/src/main/resources/org/apache/any23/extractor/html/example-meta.html
A         core/src/main/resources/org/apache/any23/extractor/html/example-mf-species.html
A         core/src/main/resources/org/apache/any23/extractor/html/example-mf-xfn.html
A         core/src/main/resources/org/apache/any23/extractor/html/example-head-link.html
A         core/src/main/resources/org/apache/any23/extractor/html/example-mf-adr.html
A         core/src/main/resources/org/apache/any23/extractor/html/example-mf-hresume.html
A         core/src/main/resources/org/apache/any23/extractor/html/example-mf-hreview.html
A         core/src/main/resources/org/apache/any23/extractor/html/example-icbm.html
A         core/src/main/resources/org/apache/any23/extractor/html/example-mf-geo.html
A         core/src/main/resources/org/apache/any23/extractor/html/example-mf-hrecipe.html
A         core/src/main/resources/org/apache/any23/extractor/html/example-mf-hcalendar.html
A         core/src/main/resources/org/apache/any23/extractor/html/example-mf-hcard.html
A         core/src/main/resources/org/apache/any23/extractor/html/example-mf-hlisting.html
A         core/src/main/resources/org/apache/any23/extractor/html/example-script-turtle.html
A         core/src/main/resources/org/apache/any23/extractor/html/example-title.html
A         core/src/main/resources/org/apache/any23/extractor/html/example-mf-license.html
A         core/src/main/resources/org/apache/any23/extractor/csv
A         core/src/main/resources/org/apache/any23/extractor/csv/example-csv.csv
A         core/src/main/resources/org/apache/any23/extractor/rdf
A         core/src/main/resources/org/apache/any23/extractor/rdf/example-rdfxml.rdf
A         core/src/main/resources/org/apache/any23/extractor/rdf/example-nquads.nq
A         core/src/main/resources/org/apache/any23/extractor/rdf/example-ntriples.nt
A         core/src/main/resources/org/apache/any23/extractor/rdf/example-turtle.ttl
A         core/src/main/resources/org/apache/any23/extractor/rdf/example-trix.trx
A         core/src/main/resources/org/apache/any23/extractor/rdfa
A         core/src/main/resources/org/apache/any23/extractor/rdfa/rdfa.xslt
A         core/src/main/resources/org/apache/any23/extractor/rdfa/example-rdfa11.html
AU        core/pom.xml
AU        DISCLAIMER.txt
AU        pom.xml
AU        README.txt
 U        .
At revision 1297356
no change for https://svn.apache.org/repos/asf/incubator/any23/trunk since the previous build
Parsing POMs
Modules changed, recalculating dependency graph
[Any23-trunk] $ /home/hudson/tools/java/latest1.6/bin/java -cp /home/jenkins/jenkins-slave/maven3-agent.jar:/home/hudson/tools/maven/latest/boot/plexus-classworlds-2.4.jar
org.jvnet.hudson.maven3.agent.Maven3Main /home/hudson/tools/maven/latest /home/jenkins/jenkins-slave/slave.jar
/home/jenkins/jenkins-slave/maven3-interceptor.jar 42081
<===[JENKINS REMOTING CAPACITY]===>channel started
   Executing Maven:  -B -f <https://builds.apache.org/job/Any23-trunk/ws/pom.xml> -Dmaven.repo.local=/home/jenkins/jenkins-slave/maven-repositories/0
install
[INFO] Scanning for projects...
[INFO] ------------------------------------------------------------------------
[INFO] Reactor Build Order:
[INFO] 
[INFO] Apache Any23 :: Parent
[INFO] Apache Any23 :: Core
[INFO] Apache Any23 :: Plugins :: Basic Crawler
[INFO] Apache Any23 :: Plugins :: HTML Scraper
[INFO] Apache Any23 :: Plugins :: Office Scraper
[INFO] Apache Any23 :: Plugins :: Integration Test
[INFO] Apache Any23 :: Service
[INFO]                                                                         
[INFO] ------------------------------------------------------------------------
[INFO] Building Apache Any23 :: Parent 0.7.0-incubating-SNAPSHOT
[INFO] ------------------------------------------------------------------------
Downloading: http://repo1.maven.org/maven2/org/codehaus/mojo/cobertura-maven-plugin/2.0/cobertura-maven-plugin-2.0.pom
Downloaded: http://repo1.maven.org/maven2/org/codehaus/mojo/cobertura-maven-plugin/2.0/cobertura-maven-plugin-2.0.pom
(4 KB at 7.0 KB/sec)
Downloading: http://repo1.maven.org/maven2/org/codehaus/mojo/cobertura-maven-plugin/2.0/cobertura-maven-plugin-2.0.jar
Downloaded: http://repo1.maven.org/maven2/org/codehaus/mojo/cobertura-maven-plugin/2.0/cobertura-maven-plugin-2.0.jar
(26 KB at 60.5 KB/sec)
[INFO] 
[INFO] --- buildnumber-maven-plugin:1.0:create (default) @ any23-parent ---
[INFO] Checking for local modifications: skipped.
[INFO] Updating project files from SCM: skipped.
[INFO] Executing: /bin/sh -c cd <https://builds.apache.org/job/Any23-trunk/ws/> &&
svn --non-interactive info
[INFO] Working directory: <https://builds.apache.org/job/Any23-trunk/ws/>
[INFO] Storing buildNumber: 1296871 at timestamp: 1331017349011
[INFO] Executing: /bin/sh -c cd <https://builds.apache.org/job/Any23-trunk/ws/> &&
svn --non-interactive info
[INFO] Working directory: <https://builds.apache.org/job/Any23-trunk/ws/>
[INFO] Storing buildScmBranch: trunk
log4j:WARN No appenders could be found for logger (org.apache.commons.beanutils.converters.BooleanConverter).
log4j:WARN Please initialize the log4j system properly.
[INFO] 
[INFO] --- maven-remote-resources-plugin:1.2.1:process (default) @ any23-parent ---
Downloading: http://repo1.maven.org/maven2/org/kohsuke/metainf-services/metainf-services/1.3/metainf-services-1.3.pom
Downloaded: http://repo1.maven.org/maven2/org/kohsuke/metainf-services/metainf-services/1.3/metainf-services-1.3.pom
(4 KB at 8.9 KB/sec)
Downloading: http://repo1.maven.org/maven2/org/kohsuke/metainf-services/metainf-services/1.3/metainf-services-1.3.jar
Downloaded: http://repo1.maven.org/maven2/org/kohsuke/metainf-services/metainf-services/1.3/metainf-services-1.3.jar
(7 KB at 15.3 KB/sec)
[INFO] Downloading: http://repo1.maven.org/maven2/org/jvnet/wagon-svn/wagon-svn/1.12/wagon-svn-1.12.pom

[INFO] --- maven-site-plugin:3.0:attach-descriptor (attach-descriptor) @ any23-parent ---
Downloaded: http://repo1.maven.org/maven2/org/jvnet/wagon-svn/wagon-svn/1.12/wagon-svn-1.12.pom
(3 KB at 7.4 KB/sec)
Downloading: http://repo1.maven.org/maven2/org/jvnet/hudson/svnkit/svnkit/1.1.4-hudson-4/svnkit-1.1.4-hudson-4.pom
Downloaded: http://repo1.maven.org/maven2/org/jvnet/hudson/svnkit/svnkit/1.1.4-hudson-4/svnkit-1.1.4-hudson-4.pom
(2 KB at 2.3 KB/sec)
Downloading: http://repo1.maven.org/maven2/org/jvnet/wagon-svn/wagon-svn/1.12/wagon-svn-1.12.jar
Downloading: http://repo1.maven.org/maven2/org/jvnet/hudson/svnkit/svnkit/1.1.4-hudson-4/svnkit-1.1.4-hudson-4.jar
Downloaded: http://repo1.maven.org/maven2/org/jvnet/wagon-svn/wagon-svn/1.12/wagon-svn-1.12.jar
(20 KB at 29.6 KB/sec)
Downloaded: http://repo1.maven.org/maven2/org/jvnet/hudson/svnkit/svnkit/1.1.4-hudson-4/svnkit-1.1.4-hudson-4.jar
(1195 KB at 1307.0 KB/sec)
[INFO] [INFO] Installing <https://builds.apache.org/job/Any23-trunk/ws/pom.xml> to /home/jenkins/jenkins-slave/maven-repositories/0/org/apache/any23/any23-parent/0.7.0-incubating-SNAPSHOT/any23-parent-0.7.0-incubating-SNAPSHOT.pom
[INFO] Installing <https://builds.apache.org/job/Any23-trunk/ws/target/any23-parent-0.7.0-incubating-SNAPSHOT-site.xml>
to /home/jenkins/jenkins-slave/maven-repositories/0/org/apache/any23/any23-parent/0.7.0-incubating-SNAPSHOT/any23-parent-0.7.0-incubating-SNAPSHOT-site.xml

[INFO] --- maven-install-plugin:2.3.1:install (default-install) @ any23-parent ---
[JENKINS] Archiving <https://builds.apache.org/job/Any23-trunk/ws/pom.xml> to /home/hudson/hudson/jobs/Any23-trunk/modules/org.apache.any23$any23-parent/builds/2012-03-06_07-01-55/archive/org.apache.any23/any23-parent/0.7.0-incubating-SNAPSHOT/any23-parent-0.7.0-incubating-SNAPSHOT.pom
[JENKINS] Archiving <https://builds.apache.org/job/Any23-trunk/ws/target/any23-parent-0.7.0-incubating-SNAPSHOT-site.xml>
to /home/hudson/hudson/jobs/Any23-trunk/modules/org.apache.any23$any23-parent/builds/2012-03-06_07-01-55/archive/org.apache.any23/any23-parent/0.7.0-incubating-SNAPSHOT/any23-parent-0.7.0-incubating-SNAPSHOT-site.xml
[INFO]                                                                         
[INFO] ------------------------------------------------------------------------
[INFO] Building Apache Any23 :: Core 0.7.0-incubating-SNAPSHOT
[INFO] ------------------------------------------------------------------------
Downloading: http://repo1.maven.org/maven2/org/apache/maven/plugins/maven-assembly-plugin/2.2.2/maven-assembly-plugin-2.2.2.pom
Downloaded: http://repo1.maven.org/maven2/org/apache/maven/plugins/maven-assembly-plugin/2.2.2/maven-assembly-plugin-2.2.2.pom
(16 KB at 43.3 KB/sec)
Downloading: http://repo1.maven.org/maven2/org/apache/maven/plugins/maven-assembly-plugin/2.2.2/maven-assembly-plugin-2.2.2.jar
Downloaded: http://repo1.maven.org/maven2/org/apache/maven/plugins/maven-assembly-plugin/2.2.2/maven-assembly-plugin-2.2.2.jar
(216 KB at 286.3 KB/sec)
Downloading: http://repo1.maven.org/maven2/net/sourceforge/nekohtml/nekohtml/1.9.14/nekohtml-1.9.14.pom
Downloaded: http://repo1.maven.org/maven2/net/sourceforge/nekohtml/nekohtml/1.9.14/nekohtml-1.9.14.pom
(2 KB at 2.8 KB/sec)
Downloading: http://repo1.maven.org/maven2/org/openrdf/sesame/sesame-model/2.6.1/sesame-model-2.6.1.pom
[WARNING] The POM for org.openrdf.sesame:sesame-model:jar:2.6.1 is missing, no dependency
information available
Downloading: http://repo1.maven.org/maven2/org/openrdf/sesame/sesame-rio-api/2.6.1/sesame-rio-api-2.6.1.pom
[WARNING] The POM for org.openrdf.sesame:sesame-rio-api:jar:2.6.1 is missing, no dependency
information available
Downloading: http://repo1.maven.org/maven2/org/openrdf/sesame/sesame-rio-turtle/2.6.1/sesame-rio-turtle-2.6.1.pom
[WARNING] The POM for org.openrdf.sesame:sesame-rio-turtle:jar:2.6.1 is missing, no dependency
information available
Downloading: http://repo1.maven.org/maven2/org/openrdf/sesame/sesame-rio-rdfxml/2.6.1/sesame-rio-rdfxml-2.6.1.pom
[WARNING] The POM for org.openrdf.sesame:sesame-rio-rdfxml:jar:2.6.1 is missing, no dependency
information available
Downloading: http://repo1.maven.org/maven2/org/openrdf/sesame/sesame-rio-ntriples/2.6.1/sesame-rio-ntriples-2.6.1.pom
[WARNING] The POM for org.openrdf.sesame:sesame-rio-ntriples:jar:2.6.1 is missing, no dependency
information available
Downloading: http://repo1.maven.org/maven2/org/openrdf/sesame/sesame-rio-trix/2.6.1/sesame-rio-trix-2.6.1.pom
[WARNING] The POM for org.openrdf.sesame:sesame-rio-trix:jar:2.6.1 is missing, no dependency
information available
Downloading: http://repo1.maven.org/maven2/org/openrdf/sesame/sesame-repository-sail/2.6.1/sesame-repository-sail-2.6.1.pom
[WARNING] The POM for org.openrdf.sesame:sesame-repository-sail:jar:2.6.1 is missing, no dependency
information available
Downloading: http://repo1.maven.org/maven2/org/openrdf/sesame/sesame-sail-memory/2.6.1/sesame-sail-memory-2.6.1.pom
[WARNING] The POM for org.openrdf.sesame:sesame-sail-memory:jar:2.6.1 is missing, no dependency
information available
Downloading: http://repo1.maven.org/maven2/org/openrdf/sesame/sesame-repository-api/2.6.1/sesame-repository-api-2.6.1.pom
[WARNING] The POM for org.openrdf.sesame:sesame-repository-api:jar:2.6.1 is missing, no dependency
information available
Downloading: http://repo1.maven.org/maven2/info/aduna/commons/aduna-commons-xml/2.7.0/aduna-commons-xml-2.7.0.pom
[WARNING] The POM for info.aduna.commons:aduna-commons-xml:jar:2.7.0 is missing, no dependency
information available
Downloading: http://repo1.maven.org/maven2/info/aduna/commons/aduna-commons-text/2.7.0/aduna-commons-text-2.7.0.pom
[WARNING] The POM for info.aduna.commons:aduna-commons-text:jar:2.7.0 is missing, no dependency
information available
Downloading: http://repo1.maven.org/maven2/info/aduna/commons/aduna-commons-net/2.7.0/aduna-commons-net-2.7.0.pom
[WARNING] The POM for info.aduna.commons:aduna-commons-net:jar:2.7.0 is missing, no dependency
information available
Downloading: http://repo1.maven.org/maven2/info/aduna/commons/aduna-commons-lang/2.9.0/aduna-commons-lang-2.9.0.pom
[WARNING] The POM for info.aduna.commons:aduna-commons-lang:jar:2.9.0 is missing, no dependency
information available
Downloading: http://repo1.maven.org/maven2/info/aduna/commons/aduna-commons-iteration/2.10.0/aduna-commons-iteration-2.10.0.pom
[WARNING] The POM for info.aduna.commons:aduna-commons-iteration:jar:2.10.0 is missing, no
dependency information available
Downloading: http://repo1.maven.org/maven2/info/aduna/commons/aduna-commons-io/2.10.0/aduna-commons-io-2.10.0.pom
[WARNING] The POM for info.aduna.commons:aduna-commons-io:jar:2.10.0 is missing, no dependency
information available
Downloading: http://repo1.maven.org/maven2/info/aduna/commons/aduna-commons-concurrent/2.7.0/aduna-commons-concurrent-2.7.0.pom
[WARNING] The POM for info.aduna.commons:aduna-commons-concurrent:jar:2.7.0 is missing, no
dependency information available
Downloading: http://repo1.maven.org/maven2/org/apache/commons/commons-csv/1.0-SNAPSHOT-rev1148315/commons-csv-1.0-SNAPSHOT-rev1148315.pom
[WARNING] The POM for org.apache.commons:commons-csv:jar:1.0-SNAPSHOT-rev1148315 is missing,
no dependency information available
Downloading: http://repo1.maven.org/maven2/net/sourceforge/nekohtml/nekohtml/1.9.14/nekohtml-1.9.14.jar
Downloading: http://repo1.maven.org/maven2/org/apache/pdfbox/pdfbox/0.8.0-incubating/pdfbox-0.8.0-incubating.jar
Downloading: http://repo1.maven.org/maven2/org/apache/pdfbox/fontbox/0.8.0-incubator/fontbox-0.8.0-incubator.jar
Downloading: http://repo1.maven.org/maven2/org/apache/pdfbox/jempbox/0.8.0-incubator/jempbox-0.8.0-incubator.jar
Downloading: http://repo1.maven.org/maven2/org/openrdf/sesame/sesame-model/2.6.1/sesame-model-2.6.1.jar
Downloading: http://repo1.maven.org/maven2/org/openrdf/sesame/sesame-rio-api/2.6.1/sesame-rio-api-2.6.1.jar
Downloaded: http://repo1.maven.org/maven2/net/sourceforge/nekohtml/nekohtml/1.9.14/nekohtml-1.9.14.jar
(122 KB at 71.7 KB/sec)
Downloading: http://repo1.maven.org/maven2/org/openrdf/sesame/sesame-rio-turtle/2.6.1/sesame-rio-turtle-2.6.1.jar
Downloaded: http://repo1.maven.org/maven2/org/apache/pdfbox/jempbox/0.8.0-incubator/jempbox-0.8.0-incubator.jar
(50 KB at 28.8 KB/sec)
Downloading: http://repo1.maven.org/maven2/org/openrdf/sesame/sesame-rio-rdfxml/2.6.1/sesame-rio-rdfxml-2.6.1.jar
Downloaded: http://repo1.maven.org/maven2/org/apache/pdfbox/fontbox/0.8.0-incubator/fontbox-0.8.0-incubator.jar
(73 KB at 37.4 KB/sec)
Downloading: http://repo1.maven.org/maven2/org/openrdf/sesame/sesame-rio-ntriples/2.6.1/sesame-rio-ntriples-2.6.1.jar
Downloading: http://repo1.maven.org/maven2/org/openrdf/sesame/sesame-rio-trix/2.6.1/sesame-rio-trix-2.6.1.jar
Downloading: http://repo1.maven.org/maven2/org/openrdf/sesame/sesame-repository-sail/2.6.1/sesame-repository-sail-2.6.1.jar
Downloaded: http://repo1.maven.org/maven2/org/apache/pdfbox/pdfbox/0.8.0-incubating/pdfbox-0.8.0-incubating.jar
(4548 KB at 1673.7 KB/sec)
Downloading: http://repo1.maven.org/maven2/org/openrdf/sesame/sesame-sail-memory/2.6.1/sesame-sail-memory-2.6.1.jar
Downloading: http://repo1.maven.org/maven2/org/openrdf/sesame/sesame-repository-api/2.6.1/sesame-repository-api-2.6.1.jar
Downloading: http://repo1.maven.org/maven2/info/aduna/commons/aduna-commons-xml/2.7.0/aduna-commons-xml-2.7.0.jar
Downloading: http://repo1.maven.org/maven2/info/aduna/commons/aduna-commons-text/2.7.0/aduna-commons-text-2.7.0.jar
Downloading: http://repo1.maven.org/maven2/info/aduna/commons/aduna-commons-net/2.7.0/aduna-commons-net-2.7.0.jar
Downloading: http://repo1.maven.org/maven2/info/aduna/commons/aduna-commons-lang/2.9.0/aduna-commons-lang-2.9.0.jar
Downloading: http://repo1.maven.org/maven2/info/aduna/commons/aduna-commons-iteration/2.10.0/aduna-commons-iteration-2.10.0.jar
Downloading: http://repo1.maven.org/maven2/info/aduna/commons/aduna-commons-io/2.10.0/aduna-commons-io-2.10.0.jar
Downloading: http://repo1.maven.org/maven2/info/aduna/commons/aduna-commons-concurrent/2.7.0/aduna-commons-concurrent-2.7.0.jar
Downloading: http://repo1.maven.org/maven2/org/apache/commons/commons-csv/1.0-SNAPSHOT-rev1148315/commons-csv-1.0-SNAPSHOT-rev1148315.jar
[JENKINS] Archiving <https://builds.apache.org/job/Any23-trunk/ws/core/pom.xml> to /home/hudson/hudson/jobs/Any23-trunk/modules/org.apache.any23$any23-core/builds/2012-03-06_07-01-55/archive/org.apache.any23/any23-core/0.7.0-incubating-SNAPSHOT/any23-core-0.7.0-incubating-SNAPSHOT.pom
[INFO] ------------------------------------------------------------------------
[INFO] Reactor Summary:
[INFO] 
[INFO] Apache Any23 :: Parent ............................ SUCCESS [1:22.629s]
[INFO] Apache Any23 :: Core .............................. FAILURE [12.529s]
[INFO] Apache Any23 :: Plugins :: Basic Crawler .......... SKIPPED
[INFO] Apache Any23 :: Plugins :: HTML Scraper ........... SKIPPED
[INFO] Apache Any23 :: Plugins :: Office Scraper ......... SKIPPED
[INFO] Apache Any23 :: Plugins :: Integration Test ....... SKIPPED
[INFO] Apache Any23 :: Service ........................... SKIPPED
[INFO] ------------------------------------------------------------------------
[INFO] BUILD FAILURE
[INFO] ------------------------------------------------------------------------
[INFO] Total time: 1:47.501s
[INFO] Finished at: Tue Mar 06 07:04:07 UTC 2012
[INFO] Final Memory: 12M/67M
[INFO] ------------------------------------------------------------------------
mavenExecutionResult exceptions not empty
message : Failed to execute goal on project any23-core: Could not resolve dependencies for
project org.apache.any23:any23-core:jar:0.7.0-incubating-SNAPSHOT: The following artifacts
could not be resolved: org.openrdf.sesame:sesame-model:jar:2.6.1, org.openrdf.sesame:sesame-rio-api:jar:2.6.1,
org.openrdf.sesame:sesame-rio-turtle:jar:2.6.1, org.openrdf.sesame:sesame-rio-rdfxml:jar:2.6.1,
org.openrdf.sesame:sesame-rio-ntriples:jar:2.6.1, org.openrdf.sesame:sesame-rio-trix:jar:2.6.1,
org.openrdf.sesame:sesame-repository-sail:jar:2.6.1, org.openrdf.sesame:sesame-sail-memory:jar:2.6.1,
org.openrdf.sesame:sesame-repository-api:jar:2.6.1, info.aduna.commons:aduna-commons-xml:jar:2.7.0,
info.aduna.commons:aduna-commons-text:jar:2.7.0, info.aduna.commons:aduna-commons-net:jar:2.7.0,
info.aduna.commons:aduna-commons-lang:jar:2.9.0, info.aduna.commons:aduna-commons-iteration:jar:2.10.0,
info.aduna.commons:aduna-commons-io:jar:2.10.0, info.aduna.commons:aduna-commons-concurrent:jar:2.7.0,
org.apache.commons:commons-csv:jar:1.0-SNAPSHOT-rev1148315: Could not find artifact org.openrdf.sesame:sesame-model:jar:2.6.1
in central (http://repo1.maven.org/maven2)
cause : Could not resolve dependencies for project org.apache.any23:any23-core:jar:0.7.0-incubating-SNAPSHOT:
The following artifacts could not be resolved: org.openrdf.sesame:sesame-model:jar:2.6.1,
org.openrdf.sesame:sesame-rio-api:jar:2.6.1, org.openrdf.sesame:sesame-rio-turtle:jar:2.6.1,
org.openrdf.sesame:sesame-rio-rdfxml:jar:2.6.1, org.openrdf.sesame:sesame-rio-ntriples:jar:2.6.1,
org.openrdf.sesame:sesame-rio-trix:jar:2.6.1, org.openrdf.sesame:sesame-repository-sail:jar:2.6.1,
org.openrdf.sesame:sesame-sail-memory:jar:2.6.1, org.openrdf.sesame:sesame-repository-api:jar:2.6.1,
info.aduna.commons:aduna-commons-xml:jar:2.7.0, info.aduna.commons:aduna-commons-text:jar:2.7.0,
info.aduna.commons:aduna-commons-net:jar:2.7.0, info.aduna.commons:aduna-commons-lang:jar:2.9.0,
info.aduna.commons:aduna-commons-iteration:jar:2.10.0, info.aduna.commons:aduna-commons-io:jar:2.10.0,
info.aduna.commons:aduna-commons-concurrent:jar:2.7.0, org.apache.commons:commons-csv:jar:1.0-SNAPSHOT-rev1148315:
Could not find artifact org.openrdf.sesame:sesame-model:jar:2.6.1 in central (http://repo1.maven.org/maven2)
Stack trace : 
org.apache.maven.lifecycle.LifecycleExecutionException: Failed to execute goal on project
any23-core: Could not resolve dependencies for project org.apache.any23:any23-core:jar:0.7.0-incubating-SNAPSHOT:
The following artifacts could not be resolved: org.openrdf.sesame:sesame-model:jar:2.6.1,
org.openrdf.sesame:sesame-rio-api:jar:2.6.1, org.openrdf.sesame:sesame-rio-turtle:jar:2.6.1,
org.openrdf.sesame:sesame-rio-rdfxml:jar:2.6.1, org.openrdf.sesame:sesame-rio-ntriples:jar:2.6.1,
org.openrdf.sesame:sesame-rio-trix:jar:2.6.1, org.openrdf.sesame:sesame-repository-sail:jar:2.6.1,
org.openrdf.sesame:sesame-sail-memory:jar:2.6.1, org.openrdf.sesame:sesame-repository-api:jar:2.6.1,
info.aduna.commons:aduna-commons-xml:jar:2.7.0, info.aduna.commons:aduna-commons-text:jar:2.7.0,
info.aduna.commons:aduna-commons-net:jar:2.7.0, info.aduna.commons:aduna-commons-lang:jar:2.9.0,
info.aduna.commons:aduna-commons-iteration:jar:2.10.0, info.aduna.commons:aduna-commons-io:jar:2.10.0,
info.aduna.commons:aduna-commons-concurrent:jar:2.7.0, org.apache.commons:commons-csv:jar:1.0-SNAPSHOT-rev1148315:
Could not find artifact org.openrdf.sesame:sesame-model:jar:2.6.1 in central (http://repo1.maven.org/maven2)
	at org.apache.maven.lifecycle.internal.LifecycleDependencyResolver.getDependencies(LifecycleDependencyResolver.java:196)
	at org.apache.maven.lifecycle.internal.LifecycleDependencyResolver.resolveProjectDependencies(LifecycleDependencyResolver.java:108)
	at org.apache.maven.lifecycle.internal.MojoExecutor.ensureDependenciesAreResolved(MojoExecutor.java:258)
	at org.apache.maven.lifecycle.internal.MojoExecutor.execute(MojoExecutor.java:201)
	at org.apache.maven.lifecycle.internal.MojoExecutor.execute(MojoExecutor.java:153)
	at org.apache.maven.lifecycle.internal.MojoExecutor.execute(MojoExecutor.java:145)
	at org.apache.maven.lifecycle.internal.LifecycleModuleBuilder.buildProject(LifecycleModuleBuilder.java:84)
	at org.apache.maven.lifecycle.internal.LifecycleModuleBuilder.buildProject(LifecycleModuleBuilder.java:59)
	at org.apache.maven.lifecycle.internal.LifecycleStarter.singleThreadedBuild(LifecycleStarter.java:183)
	at org.apache.maven.lifecycle.internal.LifecycleStarter.execute(LifecycleStarter.java:161)
	at org.apache.maven.DefaultMaven.doExecute(DefaultMaven.java:319)
	at org.apache.maven.DefaultMaven.execute(DefaultMaven.java:156)
	at org.jvnet.hudson.maven3.launcher.Maven3Launcher.main(Maven3Launcher.java:79)
	at sun.reflect.NativeMethodAccessorImpl.invoke0(Native Method)
	at sun.reflect.NativeMethodAccessorImpl.invoke(NativeMethodAccessorImpl.java:39)
	at sun.reflect.DelegatingMethodAccessorImpl.invoke(DelegatingMethodAccessorImpl.java:25)
	at java.lang.reflect.Method.invoke(Method.java:597)
	at org.codehaus.plexus.classworlds.launcher.Launcher.launchStandard(Launcher.java:329)
	at org.codehaus.plexus.classworlds.launcher.Launcher.launch(Launcher.java:239)
	at org.jvnet.hudson.maven3.agent.Maven3Main.launch(Maven3Main.java:158)
	at hudson.maven.Maven3Builder.call(Maven3Builder.java:104)
	at hudson.maven.Maven3Builder.call(Maven3Builder.java:70)
	at hudson.remoting.UserRequest.perform(UserRequest.java:118)
	at hudson.remoting.UserRequest.perform(UserRequest.java:48)
	at hudson.remoting.Request$2.run(Request.java:287)
	at hudson.remoting.InterceptingExecutorService$1.call(InterceptingExecutorService.java:72)
	at java.util.concurrent.FutureTask$Sync.innerRun(FutureTask.java:303)
	at java.util.concurrent.FutureTask.run(FutureTask.java:138)
	at java.util.concurrent.ThreadPoolExecutor$Worker.runTask(ThreadPoolExecutor.java:886)
	at java.util.concurrent.ThreadPoolExecutor$Worker.run(ThreadPoolExecutor.java:908)
	at java.lang.Thread.run(Thread.java:662)
Caused by: org.apache.maven.project.DependencyResolutionException: Could not resolve dependencies
for project org.apache.any23:any23-core:jar:0.7.0-incubating-SNAPSHOT: The following artifacts
could not be resolved: org.openrdf.sesame:sesame-model:jar:2.6.1, org.openrdf.sesame:sesame-rio-api:jar:2.6.1,
org.openrdf.sesame:sesame-rio-turtle:jar:2.6.1, org.openrdf.sesame:sesame-rio-rdfxml:jar:2.6.1,
org.openrdf.sesame:sesame-rio-ntriples:jar:2.6.1, org.openrdf.sesame:sesame-rio-trix:jar:2.6.1,
org.openrdf.sesame:sesame-repository-sail:jar:2.6.1, org.openrdf.sesame:sesame-sail-memory:jar:2.6.1,
org.openrdf.sesame:sesame-repository-api:jar:2.6.1, info.aduna.commons:aduna-commons-xml:jar:2.7.0,
info.aduna.commons:aduna-commons-text:jar:2.7.0, info.aduna.commons:aduna-commons-net:jar:2.7.0,
info.aduna.commons:aduna-commons-lang:jar:2.9.0, info.aduna.commons:aduna-commons-iteration:jar:2.10.0,
info.aduna.commons:aduna-commons-io:jar:2.10.0, info.aduna.commons:aduna-commons-concurrent:jar:2.7.0,
org.apache.commons:commons-csv:jar:1.0-SNAPSHOT-rev1148315: Could not find artifact org.openrdf.sesame:sesame-model:jar:2.6.1
in central (http://repo1.maven.org/maven2)
	at org.apache.maven.project.DefaultProjectDependenciesResolver.resolve(DefaultProjectDependenciesResolver.java:170)
	at org.apache.maven.lifecycle.internal.LifecycleDependencyResolver.getDependencies(LifecycleDependencyResolver.java:171)
	... 30 more
Caused by: org.sonatype.aether.resolution.DependencyResolutionException: The following artifacts
could not be resolved: org.openrdf.sesame:sesame-model:jar:2.6.1, org.openrdf.sesame:sesame-rio-api:jar:2.6.1,
org.openrdf.sesame:sesame-rio-turtle:jar:2.6.1, org.openrdf.sesame:sesame-rio-rdfxml:jar:2.6.1,
org.openrdf.sesame:sesame-rio-ntriples:jar:2.6.1, org.openrdf.sesame:sesame-rio-trix:jar:2.6.1,
org.openrdf.sesame:sesame-repository-sail:jar:2.6.1, org.openrdf.sesame:sesame-sail-memory:jar:2.6.1,
org.openrdf.sesame:sesame-repository-api:jar:2.6.1, info.aduna.commons:aduna-commons-xml:jar:2.7.0,
info.aduna.commons:aduna-commons-text:jar:2.7.0, info.aduna.commons:aduna-commons-net:jar:2.7.0,
info.aduna.commons:aduna-commons-lang:jar:2.9.0, info.aduna.commons:aduna-commons-iteration:jar:2.10.0,
info.aduna.commons:aduna-commons-io:jar:2.10.0, info.aduna.commons:aduna-commons-concurrent:jar:2.7.0,
org.apache.commons:commons-csv:jar:1.0-SNAPSHOT-rev1148315: Could not find artifact org.openrdf.sesame:sesame-model:jar:2.6.1
in central (http://repo1.maven.org/maven2)
	at org.sonatype.aether.impl.internal.DefaultRepositorySystem.resolveDependencies(DefaultRepositorySystem.java:412)
	at org.apache.maven.project.DefaultProjectDependenciesResolver.resolve(DefaultProjectDependenciesResolver.java:164)
	... 31 more
Caused by: org.sonatype.aether.resolution.ArtifactResolutionException: The following artifacts
could not be resolved: org.openrdf.sesame:sesame-model:jar:2.6.1, org.openrdf.sesame:sesame-rio-api:jar:2.6.1,
org.openrdf.sesame:sesame-rio-turtle:jar:2.6.1, org.openrdf.sesame:sesame-rio-rdfxml:jar:2.6.1,
org.openrdf.sesame:sesame-rio-ntriples:jar:2.6.1, org.openrdf.sesame:sesame-rio-trix:jar:2.6.1,
org.openrdf.sesame:sesame-repository-sail:jar:2.6.1, org.openrdf.sesame:sesame-sail-memory:jar:2.6.1,
org.openrdf.sesame:sesame-repository-api:jar:2.6.1, info.aduna.commons:aduna-commons-xml:jar:2.7.0,
info.aduna.commons:aduna-commons-text:jar:2.7.0, info.aduna.commons:aduna-commons-net:jar:2.7.0,
info.aduna.commons:aduna-commons-lang:jar:2.9.0, info.aduna.commons:aduna-commons-iteration:jar:2.10.0,
info.aduna.commons:aduna-commons-io:jar:2.10.0, info.aduna.commons:aduna-commons-concurrent:jar:2.7.0,
org.apache.commons:commons-csv:jar:1.0-SNAPSHOT-rev1148315: Could not find artifact org.openrdf.sesame:sesame-model:jar:2.6.1
in central (http://repo1.maven.org/maven2)
	at org.sonatype.aether.impl.internal.DefaultArtifactResolver.resolve(DefaultArtifactResolver.java:541)
	at org.sonatype.aether.impl.internal.DefaultArtifactResolver.resolveArtifacts(DefaultArtifactResolver.java:220)
	at org.sonatype.aether.impl.internal.DefaultRepositorySystem.resolveDependencies(DefaultRepositorySystem.java:395)
	... 32 more
Caused by: org.sonatype.aether.transfer.ArtifactNotFoundException: Could not find artifact
org.openrdf.sesame:sesame-model:jar:2.6.1 in central (http://repo1.maven.org/maven2)
	at org.sonatype.aether.connector.wagon.WagonRepositoryConnector$4.wrap(WagonRepositoryConnector.java:945)
	at org.sonatype.aether.connector.wagon.WagonRepositoryConnector$4.wrap(WagonRepositoryConnector.java:940)
	at org.sonatype.aether.connector.wagon.WagonRepositoryConnector$GetTask.flush(WagonRepositoryConnector.java:695)
	at org.sonatype.aether.connector.wagon.WagonRepositoryConnector$GetTask.flush(WagonRepositoryConnector.java:689)
	at org.sonatype.aether.connector.wagon.WagonRepositoryConnector.get(WagonRepositoryConnector.java:445)
	at org.sonatype.aether.impl.internal.DefaultArtifactResolver.resolve(DefaultArtifactResolver.java:460)
	... 34 more
Sending e-mails to: any23-dev@incubator.apache.org
channel stopped


Mime
View raw message