incubator-any23-dev mailing list archives

Site index · List index
Message view « Date » · « Thread »
Top « Date » · « Thread »
From Apache Jenkins Server <jenk...@builds.apache.org>
Subject Build failed in Jenkins: Any23-trunk #148
Date Sat, 24 Mar 2012 17:04:25 GMT
See <https://builds.apache.org/job/Any23-trunk/148/>

------------------------------------------
[...truncated 805 lines...]
A         core/src/main/java/org/apache/any23/extractor/rdf/BaseRDFExtractor.java
A         core/src/main/java/org/apache/any23/extractor/rdf/TriXExtractor.java
AU        core/src/main/java/org/apache/any23/extractor/rdf/NQuadsExtractor.java
A         core/src/main/java/org/apache/any23/extractor/rdf/RDFXMLExtractor.java
A         core/src/main/java/org/apache/any23/extractor/rdf/RDFHandlerAdapter.java
A         core/src/main/java/org/apache/any23/extractor/rdf/TurtleExtractor.java
A         core/src/main/java/org/apache/any23/extractor/rdf/NTriplesExtractor.java
A         core/src/main/java/org/apache/any23/extractor/ExampleInputOutput.java
A         core/src/main/java/org/apache/any23/extractor/rdfa
AU        core/src/main/java/org/apache/any23/extractor/rdfa/XSLTStylesheetException.java
A         core/src/main/java/org/apache/any23/extractor/rdfa/XSLTStylesheet.java
A         core/src/main/java/org/apache/any23/extractor/rdfa/RDFaExtractor.java
A         core/src/main/java/org/apache/any23/extractor/rdfa/RDFa11Extractor.java
A         core/src/main/java/org/apache/any23/extractor/rdfa/RDFa11ParserException.java
A         core/src/main/java/org/apache/any23/extractor/rdfa/RDFa11Parser.java
A         core/src/main/java/org/apache/any23/rdf
A         core/src/main/java/org/apache/any23/rdf/Any23ValueFactoryWrapper.java
AU        core/src/main/java/org/apache/any23/rdf/package-info.java
A         core/src/main/java/org/apache/any23/rdf/Prefixes.java
A         core/src/main/java/org/apache/any23/rdf/PopularPrefixes.java
AU        core/src/main/java/org/apache/any23/rdf/RDFUtils.java
A         core/src/main/java/org/apache/any23/Any23.java
A         core/src/main/java/org/apache/any23/writer
A         core/src/main/java/org/apache/any23/writer/CountingTripleHandler.java
A         core/src/main/java/org/apache/any23/writer/LoggingTripleHandler.java
A         core/src/main/java/org/apache/any23/writer/WriterRegistry.java
A         core/src/main/java/org/apache/any23/writer/JSONWriter.java
A         core/src/main/java/org/apache/any23/writer/BenchmarkTripleHandler.java
A         core/src/main/java/org/apache/any23/writer/Writer.java
A         core/src/main/java/org/apache/any23/writer/RepositoryWriter.java
AU        core/src/main/java/org/apache/any23/writer/TripleHandlerException.java
A         core/src/main/java/org/apache/any23/writer/TurtleWriter.java
A         core/src/main/java/org/apache/any23/writer/CompositeTripleHandler.java
A         core/src/main/java/org/apache/any23/writer/TriXWriter.java
AU        core/src/main/java/org/apache/any23/writer/package-info.java
A         core/src/main/java/org/apache/any23/writer/FormatWriter.java
A         core/src/main/java/org/apache/any23/writer/RDFWriterTripleHandler.java
A         core/src/main/java/org/apache/any23/writer/ReportingTripleHandler.java
A         core/src/main/java/org/apache/any23/writer/NQuadsWriter.java
A         core/src/main/java/org/apache/any23/writer/URIListWriter.java
A         core/src/main/java/org/apache/any23/writer/RDFXMLWriter.java
A         core/src/main/java/org/apache/any23/writer/TripleHandler.java
A         core/src/main/java/org/apache/any23/writer/NTriplesWriter.java
A         core/src/main/java/org/apache/any23/util
A         core/src/main/java/org/apache/any23/util/FileUtils.java
A         core/src/main/java/org/apache/any23/util/LogUtils.java
A         core/src/main/java/org/apache/any23/util/URLUtils.java
AU        core/src/main/java/org/apache/any23/util/package-info.java
A         core/src/main/java/org/apache/any23/util/StringUtils.java
A         core/src/main/java/org/apache/any23/util/DiscoveryUtils.java
AU        core/src/main/java/org/apache/any23/util/MathUtils.java
A         core/src/main/java/org/apache/any23/util/StreamUtils.java
AU        core/src/main/java/org/apache/any23/util/ReaderInputStream.java
A         core/src/main/resources
A         core/src/main/resources/default-configuration.properties
A         core/src/main/resources/org
A         core/src/main/resources/org/apache
A         core/src/main/resources/org/apache/any23
A         core/src/main/resources/org/apache/any23/prefixes
AU        core/src/main/resources/org/apache/any23/prefixes/prefixes.properties
A         core/src/main/resources/org/apache/any23/mime
A         core/src/main/resources/org/apache/any23/mime/tika-config.xml
A         core/src/main/resources/org/apache/any23/mime/mimetypes.xml
A         core/src/main/resources/org/apache/any23/extractor
A         core/src/main/resources/org/apache/any23/extractor/microdata
A         core/src/main/resources/org/apache/any23/extractor/microdata/example-microdata.html
A         core/src/main/resources/org/apache/any23/extractor/html
A         core/src/main/resources/org/apache/any23/extractor/html/example-meta.html
A         core/src/main/resources/org/apache/any23/extractor/html/example-mf-species.html
A         core/src/main/resources/org/apache/any23/extractor/html/example-mf-xfn.html
A         core/src/main/resources/org/apache/any23/extractor/html/example-head-link.html
A         core/src/main/resources/org/apache/any23/extractor/html/example-mf-adr.html
A         core/src/main/resources/org/apache/any23/extractor/html/example-mf-hresume.html
A         core/src/main/resources/org/apache/any23/extractor/html/example-mf-hreview.html
A         core/src/main/resources/org/apache/any23/extractor/html/example-icbm.html
A         core/src/main/resources/org/apache/any23/extractor/html/example-mf-geo.html
A         core/src/main/resources/org/apache/any23/extractor/html/example-mf-hrecipe.html
A         core/src/main/resources/org/apache/any23/extractor/html/example-mf-hcalendar.html
A         core/src/main/resources/org/apache/any23/extractor/html/example-mf-hcard.html
A         core/src/main/resources/org/apache/any23/extractor/html/example-mf-hlisting.html
A         core/src/main/resources/org/apache/any23/extractor/html/example-script-turtle.html
A         core/src/main/resources/org/apache/any23/extractor/html/example-title.html
A         core/src/main/resources/org/apache/any23/extractor/html/example-mf-license.html
A         core/src/main/resources/org/apache/any23/extractor/csv
A         core/src/main/resources/org/apache/any23/extractor/csv/example-csv.csv
A         core/src/main/resources/org/apache/any23/extractor/rdf
A         core/src/main/resources/org/apache/any23/extractor/rdf/example-rdfxml.rdf
A         core/src/main/resources/org/apache/any23/extractor/rdf/example-nquads.nq
A         core/src/main/resources/org/apache/any23/extractor/rdf/example-ntriples.nt
A         core/src/main/resources/org/apache/any23/extractor/rdf/example-turtle.ttl
A         core/src/main/resources/org/apache/any23/extractor/rdf/example-trix.trx
A         core/src/main/resources/org/apache/any23/extractor/rdfa
A         core/src/main/resources/org/apache/any23/extractor/rdfa/rdfa.xslt
A         core/src/main/resources/org/apache/any23/extractor/rdfa/example-rdfa11.html
AU        core/pom.xml
A         core/README.txt
AU        DISCLAIMER.txt
AU        pom.xml
AU        README.txt
 U        .
At revision 1304860
no change for https://svn.apache.org/repos/asf/incubator/any23/trunk since the previous build
Parsing POMs
Modules changed, recalculating dependency graph
[Any23-trunk] $ /home/hudson/tools/java/latest1.6/bin/java -cp /home/jenkins/jenkins-slave/maven3-agent.jar:/home/hudson/tools/maven/latest/boot/plexus-classworlds-2.4.jar
org.jvnet.hudson.maven3.agent.Maven3Main /home/hudson/tools/maven/latest /x1/jenkins/jenkins-slave/slave.jar
/home/jenkins/jenkins-slave/maven3-interceptor.jar 47361
<===[JENKINS REMOTING CAPACITY]===>   channel started
log4j:WARN No appenders could be found for logger (org.apache.commons.beanutils.converters.BooleanConverter).
log4j:WARN Please initialize the log4j system properly.
Executing Maven:  -B -f <https://builds.apache.org/job/Any23-trunk/ws/pom.xml> -Dmaven.repo.local=/home/jenkins/jenkins-slave/maven-repositories/1
deploy
[INFO] Scanning for projects...
[INFO] ------------------------------------------------------------------------
[INFO] Reactor Build Order:
[INFO] 
[INFO] Apache Any23 :: Parent
[INFO] Apache Any23 :: Core
[INFO] Apache Any23 :: Plugins :: Basic Crawler
[INFO] Apache Any23 :: Plugins :: HTML Scraper
[INFO] Apache Any23 :: Plugins :: Office Scraper
[INFO] Apache Any23 :: Plugins :: Integration Test
[INFO] Apache Any23 :: Service
[INFO]                                                                         
[INFO] ------------------------------------------------------------------------
[INFO] Building Apache Any23 :: Parent 0.7.0-incubating-SNAPSHOT
[INFO] ------------------------------------------------------------------------
[INFO] 
[INFO] --- buildnumber-maven-plugin:1.0:create (default) @ any23-parent ---
[INFO] Checking for local modifications: skipped.
[INFO] Updating project files from SCM: skipped.
[INFO] Executing: /bin/sh -c cd <https://builds.apache.org/job/Any23-trunk/ws/> &&
svn --non-interactive info
[INFO] Working directory: <https://builds.apache.org/job/Any23-trunk/ws/>
[INFO] Storing buildNumber: 1304831 at timestamp: 1332608651318
[INFO] Executing: /bin/sh -c cd <https://builds.apache.org/job/Any23-trunk/ws/> &&
svn --non-interactive info
[INFO] Working directory: <https://builds.apache.org/job/Any23-trunk/ws/>
[INFO] Storing buildScmBranch: trunk
[INFO] 
[INFO] --- maven-remote-resources-plugin:1.2.1:process (default) @ any23-parent ---
[INFO] 
[INFO] --- maven-site-plugin:3.0:attach-descriptor (attach-descriptor) @ any23-parent ---
[INFO] 
[INFO] --- maven-install-plugin:2.3.1:install (default-install) @ any23-parent ---
[INFO] Installing <https://builds.apache.org/job/Any23-trunk/ws/pom.xml> to /home/jenkins/jenkins-slave/maven-repositories/1/org/apache/any23/any23-parent/0.7.0-incubating-SNAPSHOT/any23-parent-0.7.0-incubating-SNAPSHOT.pom
[INFO] Installing <https://builds.apache.org/job/Any23-trunk/ws/target/any23-parent-0.7.0-incubating-SNAPSHOT-site.xml>
to /home/jenkins/jenkins-slave/maven-repositories/1/org/apache/any23/any23-parent/0.7.0-incubating-SNAPSHOT/any23-parent-0.7.0-incubating-SNAPSHOT-site.xml
[INFO] 
[INFO] --- maven-deploy-plugin:2.5:deploy (default-deploy) @ any23-parent ---
Downloading: https://repository.apache.org/content/repositories/snapshots/org/apache/any23/any23-parent/0.7.0-incubating-SNAPSHOT/maven-metadata.xml
Downloaded: https://repository.apache.org/content/repositories/snapshots/org/apache/any23/any23-parent/0.7.0-incubating-SNAPSHOT/maven-metadata.xml
(852 B at 1.4 KB/sec)
Uploading: https://repository.apache.org/content/repositories/snapshots/org/apache/any23/any23-parent/0.7.0-incubating-SNAPSHOT/any23-parent-0.7.0-incubating-20120324.170418-46.pom
Uploaded: https://repository.apache.org/content/repositories/snapshots/org/apache/any23/any23-parent/0.7.0-incubating-SNAPSHOT/any23-parent-0.7.0-incubating-20120324.170418-46.pom
(28 KB at 186.2 KB/sec)
Downloading: https://repository.apache.org/content/repositories/snapshots/org/apache/any23/any23-parent/maven-metadata.xml
Downloaded: https://repository.apache.org/content/repositories/snapshots/org/apache/any23/any23-parent/maven-metadata.xml
(461 B at 1.1 KB/sec)
Uploading: https://repository.apache.org/content/repositories/snapshots/org/apache/any23/any23-parent/0.7.0-incubating-SNAPSHOT/maven-metadata.xml
Uploaded: https://repository.apache.org/content/repositories/snapshots/org/apache/any23/any23-parent/0.7.0-incubating-SNAPSHOT/maven-metadata.xml
(852 B at 8.2 KB/sec)
Uploading: https://repository.apache.org/content/repositories/snapshots/org/apache/any23/any23-parent/maven-metadata.xml
Uploaded: https://repository.apache.org/content/repositories/snapshots/org/apache/any23/any23-parent/maven-metadata.xml
(461 B at 3.9 KB/sec)
Uploading: https://repository.apache.org/content/repositories/snapshots/org/apache/any23/any23-parent/0.7.0-incubating-SNAPSHOT/any23-parent-0.7.0-incubating-20120324.170418-46-site.xml
Uploaded: https://repository.apache.org/content/repositories/snapshots/org/apache/any23/any23-parent/0.7.0-incubating-SNAPSHOT/any23-parent-0.7.0-incubating-20120324.170418-46-site.xml
(5 KB at 71.1 KB/sec)
Uploading: https://repository.apache.org/content/repositories/snapshots/org/apache/any23/any23-parent/0.7.0-incubating-SNAPSHOT/maven-metadata.xml
Uploaded: https://repository.apache.org/content/repositories/snapshots/org/apache/any23/any23-parent/0.7.0-incubating-SNAPSHOT/maven-metadata.xml
(852 B at 18.5 KB/sec)
[JENKINS] Archiving <https://builds.apache.org/job/Any23-trunk/ws/pom.xml> to /home/hudson/hudson/jobs/Any23-trunk/modules/org.apache.any23$any23-parent/builds/2012-03-24_17-04-04/archive/org.apache.any23/any23-parent/0.7.0-incubating-SNAPSHOT/any23-parent-0.7.0-incubating-SNAPSHOT.pom
[JENKINS] Archiving <https://builds.apache.org/job/Any23-trunk/ws/target/any23-parent-0.7.0-incubating-SNAPSHOT-site.xml>
to /home/hudson/hudson/jobs/Any23-trunk/modules/org.apache.any23$any23-parent/builds/2012-03-24_17-04-04/archive/org.apache.any23/any23-parent/0.7.0-incubating-20120324.170418-46/any23-parent-0.7.0-incubating-20120324.170418-46-site.xml
[INFO]                                                                         
[INFO] ------------------------------------------------------------------------
[INFO] Building Apache Any23 :: Core 0.7.0-incubating-SNAPSHOT
[INFO] ------------------------------------------------------------------------
Downloading: http://svn.apache.org/repos/asf/incubator/any23/repo-ext/commons-cli/commons-cli/2.0/commons-cli-2.0.pom
Downloading: http://repo.aduna-software.org/maven2/releases/commons-cli/commons-cli/2.0/commons-cli-2.0.pom
Downloading: http://repo1.maven.org/maven2/commons-cli/commons-cli/2.0/commons-cli-2.0.pom
[WARNING] The POM for commons-cli:commons-cli:jar:2.0 is missing, no dependency information
available
Downloading: http://svn.apache.org/repos/asf/incubator/any23/repo-ext/commons-cli/commons-cli/2.0/commons-cli-2.0.jar
Downloading: http://repo.aduna-software.org/maven2/releases/commons-cli/commons-cli/2.0/commons-cli-2.0.jar
Downloading: http://repo1.maven.org/maven2/commons-cli/commons-cli/2.0/commons-cli-2.0.jar
[JENKINS] Archiving <https://builds.apache.org/job/Any23-trunk/ws/core/pom.xml> to /home/hudson/hudson/jobs/Any23-trunk/modules/org.apache.any23$any23-core/builds/2012-03-24_17-04-04/archive/org.apache.any23/any23-core/0.7.0-incubating-SNAPSHOT/any23-core-0.7.0-incubating-SNAPSHOT.pom
[INFO] ------------------------------------------------------------------------
[INFO] Reactor Summary:
[INFO] 
[INFO] Apache Any23 :: Parent ............................ SUCCESS [10.239s]
[INFO] Apache Any23 :: Core .............................. FAILURE [3.696s]
[INFO] Apache Any23 :: Plugins :: Basic Crawler .......... SKIPPED
[INFO] Apache Any23 :: Plugins :: HTML Scraper ........... SKIPPED
[INFO] Apache Any23 :: Plugins :: Office Scraper ......... SKIPPED
[INFO] Apache Any23 :: Plugins :: Integration Test ....... SKIPPED
[INFO] Apache Any23 :: Service ........................... SKIPPED
[INFO] ------------------------------------------------------------------------
[INFO] BUILD FAILURE
[INFO] ------------------------------------------------------------------------
[INFO] Total time: 15.521s
[INFO] Finished at: Sat Mar 24 17:04:24 UTC 2012
[INFO] Final Memory: 15M/72M
[INFO] ------------------------------------------------------------------------
Waiting for Jenkins to finish collecting data
mavenExecutionResult exceptions not empty
message : Failed to execute goal on project any23-core: Could not resolve dependencies for
project org.apache.any23:any23-core:jar:0.7.0-incubating-SNAPSHOT: Could not find artifact
commons-cli:commons-cli:jar:2.0 in any23-repository-external (http://svn.apache.org/repos/asf/incubator/any23/repo-ext/)
cause : Could not resolve dependencies for project org.apache.any23:any23-core:jar:0.7.0-incubating-SNAPSHOT:
Could not find artifact commons-cli:commons-cli:jar:2.0 in any23-repository-external (http://svn.apache.org/repos/asf/incubator/any23/repo-ext/)
Stack trace : 
org.apache.maven.lifecycle.LifecycleExecutionException: Failed to execute goal on project
any23-core: Could not resolve dependencies for project org.apache.any23:any23-core:jar:0.7.0-incubating-SNAPSHOT:
Could not find artifact commons-cli:commons-cli:jar:2.0 in any23-repository-external (http://svn.apache.org/repos/asf/incubator/any23/repo-ext/)
	at org.apache.maven.lifecycle.internal.LifecycleDependencyResolver.getDependencies(LifecycleDependencyResolver.java:196)
	at org.apache.maven.lifecycle.internal.LifecycleDependencyResolver.resolveProjectDependencies(LifecycleDependencyResolver.java:108)
	at org.apache.maven.lifecycle.internal.MojoExecutor.ensureDependenciesAreResolved(MojoExecutor.java:258)
	at org.apache.maven.lifecycle.internal.MojoExecutor.execute(MojoExecutor.java:201)
	at org.apache.maven.lifecycle.internal.MojoExecutor.execute(MojoExecutor.java:153)
	at org.apache.maven.lifecycle.internal.MojoExecutor.execute(MojoExecutor.java:145)
	at org.apache.maven.lifecycle.internal.LifecycleModuleBuilder.buildProject(LifecycleModuleBuilder.java:84)
	at org.apache.maven.lifecycle.internal.LifecycleModuleBuilder.buildProject(LifecycleModuleBuilder.java:59)
	at org.apache.maven.lifecycle.internal.LifecycleStarter.singleThreadedBuild(LifecycleStarter.java:183)
	at org.apache.maven.lifecycle.internal.LifecycleStarter.execute(LifecycleStarter.java:161)
	at org.apache.maven.DefaultMaven.doExecute(DefaultMaven.java:319)
	at org.apache.maven.DefaultMaven.execute(DefaultMaven.java:156)
	at org.jvnet.hudson.maven3.launcher.Maven3Launcher.main(Maven3Launcher.java:79)
	at sun.reflect.NativeMethodAccessorImpl.invoke0(Native Method)
	at sun.reflect.NativeMethodAccessorImpl.invoke(NativeMethodAccessorImpl.java:39)
	at sun.reflect.DelegatingMethodAccessorImpl.invoke(DelegatingMethodAccessorImpl.java:25)
	at java.lang.reflect.Method.invoke(Method.java:597)
	at org.codehaus.plexus.classworlds.launcher.Launcher.launchStandard(Launcher.java:329)
	at org.codehaus.plexus.classworlds.launcher.Launcher.launch(Launcher.java:239)
	at org.jvnet.hudson.maven3.agent.Maven3Main.launch(Maven3Main.java:158)
	at hudson.maven.Maven3Builder.call(Maven3Builder.java:104)
	at hudson.maven.Maven3Builder.call(Maven3Builder.java:70)
	at hudson.remoting.UserRequest.perform(UserRequest.java:118)
	at hudson.remoting.UserRequest.perform(UserRequest.java:48)
	at hudson.remoting.Request$2.run(Request.java:287)
	at hudson.remoting.InterceptingExecutorService$1.call(InterceptingExecutorService.java:72)
	at java.util.concurrent.FutureTask$Sync.innerRun(FutureTask.java:303)
	at java.util.concurrent.FutureTask.run(FutureTask.java:138)
	at java.util.concurrent.ThreadPoolExecutor$Worker.runTask(ThreadPoolExecutor.java:886)
	at java.util.concurrent.ThreadPoolExecutor$Worker.run(ThreadPoolExecutor.java:908)
	at java.lang.Thread.run(Thread.java:662)
Caused by: org.apache.maven.project.DependencyResolutionException: Could not resolve dependencies
for project org.apache.any23:any23-core:jar:0.7.0-incubating-SNAPSHOT: Could not find artifact
commons-cli:commons-cli:jar:2.0 in any23-repository-external (http://svn.apache.org/repos/asf/incubator/any23/repo-ext/)
	at org.apache.maven.project.DefaultProjectDependenciesResolver.resolve(DefaultProjectDependenciesResolver.java:170)
	at org.apache.maven.lifecycle.internal.LifecycleDependencyResolver.getDependencies(LifecycleDependencyResolver.java:171)
	... 30 more
Caused by: org.sonatype.aether.resolution.DependencyResolutionException: Could not find artifact
commons-cli:commons-cli:jar:2.0 in any23-repository-external (http://svn.apache.org/repos/asf/incubator/any23/repo-ext/)
	at org.sonatype.aether.impl.internal.DefaultRepositorySystem.resolveDependencies(DefaultRepositorySystem.java:412)
	at org.apache.maven.project.DefaultProjectDependenciesResolver.resolve(DefaultProjectDependenciesResolver.java:164)
	... 31 more
Caused by: org.sonatype.aether.resolution.ArtifactResolutionException: Could not find artifact
commons-cli:commons-cli:jar:2.0 in any23-repository-external (http://svn.apache.org/repos/asf/incubator/any23/repo-ext/)
	at org.sonatype.aether.impl.internal.DefaultArtifactResolver.resolve(DefaultArtifactResolver.java:541)
	at org.sonatype.aether.impl.internal.DefaultArtifactResolver.resolveArtifacts(DefaultArtifactResolver.java:220)
	at org.sonatype.aether.impl.internal.DefaultRepositorySystem.resolveDependencies(DefaultRepositorySystem.java:395)
	... 32 more
Caused by: org.sonatype.aether.transfer.ArtifactNotFoundException: Could not find artifact
commons-cli:commons-cli:jar:2.0 in any23-repository-external (http://svn.apache.org/repos/asf/incubator/any23/repo-ext/)
	at org.sonatype.aether.connector.wagon.WagonRepositoryConnector$4.wrap(WagonRepositoryConnector.java:945)
	at org.sonatype.aether.connector.wagon.WagonRepositoryConnector$4.wrap(WagonRepositoryConnector.java:940)
	at org.sonatype.aether.connector.wagon.WagonRepositoryConnector$GetTask.flush(WagonRepositoryConnector.java:695)
	at org.sonatype.aether.connector.wagon.WagonRepositoryConnector$GetTask.flush(WagonRepositoryConnector.java:689)
	at org.sonatype.aether.connector.wagon.WagonRepositoryConnector.get(WagonRepositoryConnector.java:445)
	at org.sonatype.aether.impl.internal.DefaultArtifactResolver.resolve(DefaultArtifactResolver.java:460)
	... 34 more
Sending e-mails to: any23-dev@incubator.apache.org
channel stopped

Mime
View raw message