incubator-any23-dev mailing list archives

Site index · List index
Message view « Date » · « Thread »
Top « Date » · « Thread »
From Apache Jenkins Server <jenk...@builds.apache.org>
Subject Build failed in Jenkins: Any23-trunk » Apache Any23 :: Plugins :: Integration Test #73
Date Sun, 15 Jan 2012 07:05:27 GMT
See <https://builds.apache.org/job/Any23-trunk/org.apache.any23.plugin$any23-integration-test/73/>

------------------------------------------
[INFO] Downloading: http://repo.aduna-software.org/maven2/releases/org/apache/any23/plugin/html-scraper/1.0.1-SNAPSHOT/maven-metadata.xml
                                                                        Downloading: http://any23.googlecode.com/svn/repo-ext/org/apache/any23/plugin/html-scraper/1.0.1-SNAPSHOT/maven-metadata.xml
Downloading: http://download.java.net/maven/2/org/apache/any23/plugin/html-scraper/1.0.1-SNAPSHOT/maven-metadata.xml
Downloading: http://mirrors.ibiblio.org/pub/mirrors/maven2/org/apache/any23/plugin/html-scraper/1.0.1-SNAPSHOT/maven-metadata.xml

[INFO] ------------------------------------------------------------------------
[INFO] Building Apache Any23 :: Plugins :: Integration Test 0.6.2-incubating-SNAPSHOT
[INFO] ------------------------------------------------------------------------
Downloading: https://repository.apache.org/content/groups/public/org/apache/any23/plugin/html-scraper/1.0.1-SNAPSHOT/maven-metadata.xml
Downloading: https://repository.apache.org/content/repositories/releases/org/apache/any23/plugin/html-scraper/1.0.1-SNAPSHOT/maven-metadata.xml
Downloading: http://repository.apache.org/snapshots/org/apache/any23/plugin/html-scraper/1.0.1-SNAPSHOT/maven-metadata.xml
Downloaded: https://repository.apache.org/content/groups/public/org/apache/any23/plugin/html-scraper/1.0.1-SNAPSHOT/maven-metadata.xml
(281 B at 0.5 KB/sec)
Downloaded: http://repository.apache.org/snapshots/org/apache/any23/plugin/html-scraper/1.0.1-SNAPSHOT/maven-metadata.xml
(281 B at 1.4 KB/sec)
Downloading: http://any23.googlecode.com/svn/repo-ext/org/apache/any23/plugin/html-scraper/1.0.1-SNAPSHOT/html-scraper-1.0.1-SNAPSHOT.pom
Downloading: http://repo.aduna-software.org/maven2/releases/org/apache/any23/plugin/html-scraper/1.0.1-SNAPSHOT/html-scraper-1.0.1-SNAPSHOT.pom
Downloading: http://mirrors.ibiblio.org/pub/mirrors/maven2/org/apache/any23/plugin/html-scraper/1.0.1-SNAPSHOT/html-scraper-1.0.1-SNAPSHOT.pom
Downloading: http://download.java.net/maven/2/org/apache/any23/plugin/html-scraper/1.0.1-SNAPSHOT/html-scraper-1.0.1-SNAPSHOT.pom
Downloading: https://repository.apache.org/content/groups/public/org/apache/any23/plugin/html-scraper/1.0.1-SNAPSHOT/html-scraper-1.0.1-SNAPSHOT.pom
Downloaded: https://repository.apache.org/content/groups/public/org/apache/any23/plugin/html-scraper/1.0.1-SNAPSHOT/html-scraper-1.0.1-SNAPSHOT.pom
(5 KB at 30.1 KB/sec)
Downloading: http://any23.googlecode.com/svn/repo-ext/org/apache/any23/any23-parent/0.6.2-SNAPSHOT/maven-metadata.xml
Downloading: http://download.java.net/maven/2/org/apache/any23/any23-parent/0.6.2-SNAPSHOT/maven-metadata.xml
Downloading: http://repo.aduna-software.org/maven2/releases/org/apache/any23/any23-parent/0.6.2-SNAPSHOT/maven-metadata.xml
Downloading: http://mirrors.ibiblio.org/pub/mirrors/maven2/org/apache/any23/any23-parent/0.6.2-SNAPSHOT/maven-metadata.xml
Downloading: https://repository.apache.org/content/groups/public/org/apache/any23/any23-parent/0.6.2-SNAPSHOT/maven-metadata.xml
Downloading: https://repository.apache.org/content/repositories/releases/org/apache/any23/any23-parent/0.6.2-SNAPSHOT/maven-metadata.xml
Downloading: http://repository.apache.org/snapshots/org/apache/any23/any23-parent/0.6.2-SNAPSHOT/maven-metadata.xml
Downloaded: https://repository.apache.org/content/groups/public/org/apache/any23/any23-parent/0.6.2-SNAPSHOT/maven-metadata.xml
(274 B at 0.4 KB/sec)
Downloaded: http://repository.apache.org/snapshots/org/apache/any23/any23-parent/0.6.2-SNAPSHOT/maven-metadata.xml
(274 B at 0.5 KB/sec)
Downloading: http://any23.googlecode.com/svn/repo-ext/org/apache/any23/any23-parent/0.6.2-SNAPSHOT/any23-parent-0.6.2-SNAPSHOT.pom
Downloading: http://repo.aduna-software.org/maven2/releases/org/apache/any23/any23-parent/0.6.2-SNAPSHOT/any23-parent-0.6.2-SNAPSHOT.pom
Downloading: http://mirrors.ibiblio.org/pub/mirrors/maven2/org/apache/any23/any23-parent/0.6.2-SNAPSHOT/any23-parent-0.6.2-SNAPSHOT.pom
Downloading: http://download.java.net/maven/2/org/apache/any23/any23-parent/0.6.2-SNAPSHOT/any23-parent-0.6.2-SNAPSHOT.pom
Downloading: https://repository.apache.org/content/groups/public/org/apache/any23/any23-parent/0.6.2-SNAPSHOT/any23-parent-0.6.2-SNAPSHOT.pom
Downloaded: https://repository.apache.org/content/groups/public/org/apache/any23/any23-parent/0.6.2-SNAPSHOT/any23-parent-0.6.2-SNAPSHOT.pom
(27 KB at 162.8 KB/sec)
Downloading: http://download.java.net/maven/2/org/apache/any23/plugin/office-scraper/1.0.0-SNAPSHOT/maven-metadata.xml
Downloading: http://mirrors.ibiblio.org/pub/mirrors/maven2/org/apache/any23/plugin/office-scraper/1.0.0-SNAPSHOT/maven-metadata.xml
Downloading: http://any23.googlecode.com/svn/repo-ext/org/apache/any23/plugin/office-scraper/1.0.0-SNAPSHOT/maven-metadata.xml
Downloading: http://repo.aduna-software.org/maven2/releases/org/apache/any23/plugin/office-scraper/1.0.0-SNAPSHOT/maven-metadata.xml
Downloading: https://repository.apache.org/content/groups/public/org/apache/any23/plugin/office-scraper/1.0.0-SNAPSHOT/maven-metadata.xml
Downloading: https://repository.apache.org/content/repositories/releases/org/apache/any23/plugin/office-scraper/1.0.0-SNAPSHOT/maven-metadata.xml
Downloading: http://repository.apache.org/snapshots/org/apache/any23/plugin/office-scraper/1.0.0-SNAPSHOT/maven-metadata.xml
Downloaded: https://repository.apache.org/content/groups/public/org/apache/any23/plugin/office-scraper/1.0.0-SNAPSHOT/maven-metadata.xml
(283 B at 1.4 KB/sec)
Downloaded: http://repository.apache.org/snapshots/org/apache/any23/plugin/office-scraper/1.0.0-SNAPSHOT/maven-metadata.xml
(283 B at 1.5 KB/sec)
Downloading: http://any23.googlecode.com/svn/repo-ext/org/apache/any23/plugin/office-scraper/1.0.0-SNAPSHOT/office-scraper-1.0.0-SNAPSHOT.pom
Downloading: http://repo.aduna-software.org/maven2/releases/org/apache/any23/plugin/office-scraper/1.0.0-SNAPSHOT/office-scraper-1.0.0-SNAPSHOT.pom
Downloading: http://mirrors.ibiblio.org/pub/mirrors/maven2/org/apache/any23/plugin/office-scraper/1.0.0-SNAPSHOT/office-scraper-1.0.0-SNAPSHOT.pom
Downloading: http://download.java.net/maven/2/org/apache/any23/plugin/office-scraper/1.0.0-SNAPSHOT/office-scraper-1.0.0-SNAPSHOT.pom
Downloading: https://repository.apache.org/content/groups/public/org/apache/any23/plugin/office-scraper/1.0.0-SNAPSHOT/office-scraper-1.0.0-SNAPSHOT.pom
Downloaded: https://repository.apache.org/content/groups/public/org/apache/any23/plugin/office-scraper/1.0.0-SNAPSHOT/office-scraper-1.0.0-SNAPSHOT.pom
(4 KB at 43.6 KB/sec)
Downloading: http://any23.googlecode.com/svn/repo-ext/org/apache/any23/plugin/html-scraper/1.0.1-SNAPSHOT/html-scraper-1.0.1-SNAPSHOT.jar
Downloading: http://any23.googlecode.com/svn/repo-ext/org/apache/any23/plugin/office-scraper/1.0.0-SNAPSHOT/office-scraper-1.0.0-SNAPSHOT.jar
Downloading: http://repo.aduna-software.org/maven2/releases/org/apache/any23/plugin/html-scraper/1.0.1-SNAPSHOT/html-scraper-1.0.1-SNAPSHOT.jar
Downloading: http://repo.aduna-software.org/maven2/releases/org/apache/any23/plugin/office-scraper/1.0.0-SNAPSHOT/office-scraper-1.0.0-SNAPSHOT.jar
Downloading: http://mirrors.ibiblio.org/pub/mirrors/maven2/org/apache/any23/plugin/html-scraper/1.0.1-SNAPSHOT/html-scraper-1.0.1-SNAPSHOT.jar
Downloading: http://mirrors.ibiblio.org/pub/mirrors/maven2/org/apache/any23/plugin/office-scraper/1.0.0-SNAPSHOT/office-scraper-1.0.0-SNAPSHOT.jar
Downloading: http://download.java.net/maven/2/org/apache/any23/plugin/html-scraper/1.0.1-SNAPSHOT/html-scraper-1.0.1-SNAPSHOT.jar
Downloading: http://download.java.net/maven/2/org/apache/any23/plugin/office-scraper/1.0.0-SNAPSHOT/office-scraper-1.0.0-SNAPSHOT.jar
Downloading: https://repository.apache.org/content/groups/public/org/apache/any23/plugin/html-scraper/1.0.1-SNAPSHOT/html-scraper-1.0.1-SNAPSHOT.jar
Downloading: https://repository.apache.org/content/groups/public/org/apache/any23/plugin/office-scraper/1.0.0-SNAPSHOT/office-scraper-1.0.0-SNAPSHOT.jar
Downloaded: https://repository.apache.org/content/groups/public/org/apache/any23/plugin/html-scraper/1.0.1-SNAPSHOT/html-scraper-1.0.1-SNAPSHOT.jar
(13 KB at 92.9 KB/sec)
Downloaded: https://repository.apache.org/content/groups/public/org/apache/any23/plugin/office-scraper/1.0.0-SNAPSHOT/office-scraper-1.0.0-SNAPSHOT.jar
(14 KB at 69.6 KB/sec)
[INFO] [INFO] Checking for local modifications: skipped.
[INFO] Updating project files from SCM: skipped.
[INFO] Executing: /bin/sh -c cd <https://builds.apache.org/job/Any23-trunk/org.apache.any23.plugin$any23-integration-test/ws/>
&& svn --non-interactive info
[INFO] Working directory: <https://builds.apache.org/job/Any23-trunk/org.apache.any23.plugin$any23-integration-test/ws/>
[INFO] Storing buildNumber: 1231556 at timestamp: 1326611069363
[INFO] Executing: /bin/sh -c cd <https://builds.apache.org/job/Any23-trunk/org.apache.any23.plugin$any23-integration-test/ws/>
&& svn --non-interactive info
[INFO] Working directory: <https://builds.apache.org/job/Any23-trunk/org.apache.any23.plugin$any23-integration-test/ws/>
[INFO] Storing buildScmBranch: trunk

[INFO] --- buildnumber-maven-plugin:1.0:create (default) @ any23-integration-test ---
[INFO] 
[INFO] --- maven-remote-resources-plugin:1.2.1:process (default) @ any23-integration-test
---
[debug] execute contextualize
[INFO] [INFO] Using 'UTF-8' encoding to copy filtered resources.
[INFO] Copying 0 resource
[INFO] Copying 3 resources

[INFO] --- maven-resources-plugin:2.5:resources (default-resources) @ any23-integration-test
---
[INFO] [INFO] Nothing to compile - all classes are up to date

[INFO] --- maven-compiler-plugin:2.3.2:compile (default-compile) @ any23-integration-test
---
[debug] execute contextualize
[INFO] [INFO] Using 'UTF-8' encoding to copy filtered resources.
[INFO] Copying 0 resource
[INFO] Copying 3 resources

[INFO] --- maven-resources-plugin:2.5:testResources (default-testResources) @ any23-integration-test
---
[INFO] [INFO] Compiling 1 source file to <https://builds.apache.org/job/Any23-trunk/org.apache.any23.plugin$any23-integration-test/ws/target/test-classes>

[INFO] --- maven-compiler-plugin:2.3.2:testCompile (default-testCompile) @ any23-integration-test
---
[INFO] 
[INFO] --- maven-surefire-plugin:2.4.3:test (default-test) @ any23-integration-test ---
[INFO] Surefire report directory: <https://builds.apache.org/job/Any23-trunk/org.apache.any23.plugin$any23-integration-test/ws/target/surefire-reports>

-------------------------------------------------------
 T E S T S
-------------------------------------------------------
There are no tests to run.

Results :

Tests run: 0, Failures: 0, Errors: 0, Skipped: 0

[JENKINS] Recording test results
[INFO] [INFO] Building jar: <https://builds.apache.org/job/Any23-trunk/org.apache.any23.plugin$any23-integration-test/ws/target/any23-integration-test-0.6.2-incubating-SNAPSHOT.jar>

[INFO] --- maven-jar-plugin:2.3.1:jar (default-jar) @ any23-integration-test ---
[INFO] 
[INFO] --- maven-site-plugin:3.0:attach-descriptor (attach-descriptor) @ any23-integration-test
---
[INFO] 
[INFO] --- maven-invoker-plugin:1.5:run (default) @ any23-integration-test ---
[INFO] Building: basic-crawler/pom.xml
[INFO] ..FAILED (36.2 s)
[INFO]   The build exited with code 1. See <https://builds.apache.org/job/Any23-trunk/org.apache.any23.plugin$any23-integration-test/ws/target/plugins-build/basic-crawler/build.log>
for details.
[INFO] Building: office-scraper/pom.xml
[INFO] ..FAILED (8.7 s)
[INFO]   The build exited with code 1. See <https://builds.apache.org/job/Any23-trunk/org.apache.any23.plugin$any23-integration-test/ws/target/plugins-build/office-scraper/build.log>
for details.
[INFO] Building: html-scraper/pom.xml
[INFO] ..FAILED (7.5 s)
[INFO]   The build exited with code 1. See <https://builds.apache.org/job/Any23-trunk/org.apache.any23.plugin$any23-integration-test/ws/target/plugins-build/html-scraper/build.log>
for details.
[INFO] -------------------------------------------------
[INFO] Build Summary:
[INFO]   Passed: 0, Failed: 3, Errors: 0, Skipped: 0
[INFO] -------------------------------------------------
[ERROR] The following builds failed:
[ERROR] *  basic-crawler/pom.xml
[ERROR] *  office-scraper/pom.xml
[ERROR] *  html-scraper/pom.xml
[INFO] -------------------------------------------------
[JENKINS] Archiving <https://builds.apache.org/job/Any23-trunk/org.apache.any23.plugin$any23-integration-test/ws/pom.xml>
to /home/hudson/hudson/jobs/Any23-trunk/modules/org.apache.any23.plugin$any23-integration-test/builds/2012-01-15_07-01-11/archive/org.apache.any23.plugin/any23-integration-test/0.6.2-incubating-SNAPSHOT/any23-integration-test-0.6.2-incubating-SNAPSHOT.pom
[JENKINS] Archiving <https://builds.apache.org/job/Any23-trunk/org.apache.any23.plugin$any23-integration-test/ws/target/any23-integration-test-0.6.2-incubating-SNAPSHOT.jar>
to /home/hudson/hudson/jobs/Any23-trunk/modules/org.apache.any23.plugin$any23-integration-test/builds/2012-01-15_07-01-11/archive/org.apache.any23.plugin/any23-integration-test/0.6.2-incubating-SNAPSHOT/any23-integration-test-0.6.2-incubating-SNAPSHOT.jar


Mime
View raw message