incubator-any23-dev mailing list archives

Site index · List index
Message view « Date » · « Thread »
Top « Date » · « Thread »
From Apache Jenkins Server <jenk...@builds.apache.org>
Subject Build failed in Jenkins: Any23-trunk #69
Date Sat, 14 Jan 2012 07:23:36 GMT
See <https://builds.apache.org/job/Any23-trunk/69/changes>

Changes:

[simonetripodi] updated installation description, artifacts won't have the -bin postfix

[simonetripodi] enhance target distribution package

[simonetripodi] added legal files under META-INF artifacts dirs

[simonetripodi] added license, notice & disclaimer in the distribution package

[simonetripodi] first checkin of incubation disclaimer

[simonetripodi] fixed package name in the description

[simonetripodi] [ANY23-32] replace hardcoded bash script with generated via appassembler

[simonetripodi] all artifactIds prefixed with any23-

[simonetripodi] stripped any23- prefix from directories

[simonetripodi] tabs replaced by spaces in Java sources

[simonetripodi] restored missing package, fixed broken build

[simonetripodi] dropped no longer used 3rd part library

[simonetripodi] linked changes XSD (useful for IDEs that support auto-completion)

[simonetripodi] recorded resolved closed issues

[simonetripodi] updated junit to version 4.10

[simonetripodi] removed redundant version (inherited from parent)

[simonetripodi] added the `-incubating` postfix also in plugin versions

[simonetripodi] version number must contain the `-incubating` postfix

[simonetripodi] added missing page headers
added missing license headers

[simonetripodi] s/.deri./.apache.

[simonetripodi] minor format

[simonetripodi] format, spaces instead of tabs

[simonetripodi] added EOL

[simonetripodi] added EOL

[simonetripodi] triling spaces/empty lines

[simonetripodi] fixed German spelled name

[simonetripodi] trivial format

[simonetripodi] trivial format

[simonetripodi] added EOL

[simonetripodi] trivial format

[simonetripodi] spaces instead of tabs
added EOL

[simonetripodi] removed trailing spaces/empty lines

[simonetripodi] added OEL

[simonetripodi] added OEL

[simonetripodi] better visualization

[simonetripodi] spaces instead of tabs

[simonetripodi] trivial formats

[simonetripodi] s/Any23/Apache Any23

[simonetripodi] fixed okkam link

[simonetripodi] updated License header

[simonetripodi] updated License header

[simonetripodi] updated License header

[simonetripodi] updated License header

[simonetripodi] updated License header

[simonetripodi] added core Java source license header

[simonetripodi] added site distribution management and stagingURL (it will be used for RCs)

[simonetripodi] switched browsable SCM URL to viewvc

[simonetripodi] dropped changelog plugin - consumes too much time&resources, this report
is available on ASF viewvc (see https://svn.apache.org/viewvc/incubator/any23/)

[simonetripodi] added missing notice file

[simonetripodi] updated the site url (even if not online yet)

[simonetripodi] always refer to Apache Any23 as subject

[simonetripodi] removed redundancies (inherited from parent pom)
reorganized stuff

[simonetripodi] updated pom license

[simonetripodi] updated projects name (mainly to have a clear vision in the build shell log)

[simonetripodi] CHANGES file replaced by changes descriptor for maven - which will generate
the HTML report for the site AND the textual file (to attach to ML, for example)

[simonetripodi] restored the reports menu

[simonetripodi] minor format

[simonetripodi] site *source* can be safety stay with the rest of the sources, let's keep
the site space to deploy generated pages - if there is the need of deploying the site on svn

------------------------------------------
[...truncated 97163 lines...]
[INFO] Installing /home/jenkins/.m2/repository/xml-apis/xml-apis/1.3.04/xml-apis-1.3.04.jar
to <https://builds.apache.org/job/Any23-trunk/ws/core/target/appassembler/lib/xml-apis-1.3.04.jar>
[INFO] Installing /home/jenkins/.m2/repository/org/apache/tika/tika-core/0.6/tika-core-0.6.jar
to <https://builds.apache.org/job/Any23-trunk/ws/core/target/appassembler/lib/tika-core-0.6.jar>
[INFO] Installing /home/jenkins/.m2/repository/org/apache/tika/tika-parsers/0.6/tika-parsers-0.6.jar
to <https://builds.apache.org/job/Any23-trunk/ws/core/target/appassembler/lib/tika-parsers-0.6.jar>
[INFO] Installing /home/jenkins/.m2/repository/org/apache/commons/commons-compress/1.0/commons-compress-1.0.jar
to <https://builds.apache.org/job/Any23-trunk/ws/core/target/appassembler/lib/commons-compress-1.0.jar>
[INFO] Installing /home/jenkins/.m2/repository/org/apache/pdfbox/pdfbox/0.8.0-incubating/pdfbox-0.8.0-incubating.jar
to <https://builds.apache.org/job/Any23-trunk/ws/core/target/appassembler/lib/pdfbox-0.8.0-incubating.jar>
[INFO] Installing /home/jenkins/.m2/repository/org/apache/pdfbox/fontbox/0.8.0-incubator/fontbox-0.8.0-incubator.jar
to <https://builds.apache.org/job/Any23-trunk/ws/core/target/appassembler/lib/fontbox-0.8.0-incubator.jar>
[INFO] Installing /home/jenkins/.m2/repository/org/apache/pdfbox/jempbox/0.8.0-incubator/jempbox-0.8.0-incubator.jar
to <https://builds.apache.org/job/Any23-trunk/ws/core/target/appassembler/lib/jempbox-0.8.0-incubator.jar>
[INFO] Installing /home/jenkins/.m2/repository/org/apache/poi/poi/3.6/poi-3.6.jar to <https://builds.apache.org/job/Any23-trunk/ws/core/target/appassembler/lib/poi-3.6.jar>
[INFO] Installing /home/jenkins/.m2/repository/org/apache/poi/poi-scratchpad/3.6/poi-scratchpad-3.6.jar
to <https://builds.apache.org/job/Any23-trunk/ws/core/target/appassembler/lib/poi-scratchpad-3.6.jar>
[INFO] Installing /home/jenkins/.m2/repository/org/apache/poi/poi-ooxml/3.6/poi-ooxml-3.6.jar
to <https://builds.apache.org/job/Any23-trunk/ws/core/target/appassembler/lib/poi-ooxml-3.6.jar>
[INFO] Installing /home/jenkins/.m2/repository/org/apache/poi/poi-ooxml-schemas/3.6/poi-ooxml-schemas-3.6.jar
to <https://builds.apache.org/job/Any23-trunk/ws/core/target/appassembler/lib/poi-ooxml-schemas-3.6.jar>
[INFO] Installing /home/jenkins/.m2/repository/org/apache/xmlbeans/xmlbeans/2.3.0/xmlbeans-2.3.0.jar
to <https://builds.apache.org/job/Any23-trunk/ws/core/target/appassembler/lib/xmlbeans-2.3.0.jar>
[INFO] Installing /home/jenkins/.m2/repository/dom4j/dom4j/1.6.1/dom4j-1.6.1.jar to <https://builds.apache.org/job/Any23-trunk/ws/core/target/appassembler/lib/dom4j-1.6.1.jar>
[INFO] Installing /home/jenkins/.m2/repository/org/apache/geronimo/specs/geronimo-stax-api_1.0_spec/1.0.1/geronimo-stax-api_1.0_spec-1.0.1.jar
to <https://builds.apache.org/job/Any23-trunk/ws/core/target/appassembler/lib/geronimo-stax-api_1.0_spec-1.0.1.jar>
[INFO] Installing /home/jenkins/.m2/repository/org/ccil/cowan/tagsoup/tagsoup/1.2/tagsoup-1.2.jar
to <https://builds.apache.org/job/Any23-trunk/ws/core/target/appassembler/lib/tagsoup-1.2.jar>
[INFO] Installing /home/jenkins/.m2/repository/asm/asm/3.1/asm-3.1.jar to <https://builds.apache.org/job/Any23-trunk/ws/core/target/appassembler/lib/asm-3.1.jar>
[INFO] Installing /home/jenkins/.m2/repository/log4j/log4j/1.2.14/log4j-1.2.14.jar to <https://builds.apache.org/job/Any23-trunk/ws/core/target/appassembler/lib/log4j-1.2.14.jar>
[INFO] Installing /home/jenkins/.m2/repository/com/drewnoakes/metadata-extractor/2.4.0-beta-1/metadata-extractor-2.4.0-beta-1.jar
to <https://builds.apache.org/job/Any23-trunk/ws/core/target/appassembler/lib/metadata-extractor-2.4.0-beta-1.jar>
[INFO] Installing /home/jenkins/.m2/repository/org/openrdf/sesame/sesame-model/2.6.1/sesame-model-2.6.1.jar
to <https://builds.apache.org/job/Any23-trunk/ws/core/target/appassembler/lib/sesame-model-2.6.1.jar>
[INFO] Installing /home/jenkins/.m2/repository/org/openrdf/sesame/sesame-util/2.6.1/sesame-util-2.6.1.jar
to <https://builds.apache.org/job/Any23-trunk/ws/core/target/appassembler/lib/sesame-util-2.6.1.jar>
[INFO] Installing /home/jenkins/.m2/repository/org/openrdf/sesame/sesame-rio-api/2.6.1/sesame-rio-api-2.6.1.jar
to <https://builds.apache.org/job/Any23-trunk/ws/core/target/appassembler/lib/sesame-rio-api-2.6.1.jar>
[INFO] Installing /home/jenkins/.m2/repository/org/openrdf/sesame/sesame-rio-turtle/2.6.1/sesame-rio-turtle-2.6.1.jar
to <https://builds.apache.org/job/Any23-trunk/ws/core/target/appassembler/lib/sesame-rio-turtle-2.6.1.jar>
[INFO] Installing /home/jenkins/.m2/repository/org/openrdf/sesame/sesame-rio-rdfxml/2.6.1/sesame-rio-rdfxml-2.6.1.jar
to <https://builds.apache.org/job/Any23-trunk/ws/core/target/appassembler/lib/sesame-rio-rdfxml-2.6.1.jar>
[INFO] Installing /home/jenkins/.m2/repository/org/openrdf/sesame/sesame-rio-ntriples/2.6.1/sesame-rio-ntriples-2.6.1.jar
to <https://builds.apache.org/job/Any23-trunk/ws/core/target/appassembler/lib/sesame-rio-ntriples-2.6.1.jar>
[INFO] Installing /home/jenkins/.m2/repository/org/openrdf/sesame/sesame-rio-trix/2.6.1/sesame-rio-trix-2.6.1.jar
to <https://builds.apache.org/job/Any23-trunk/ws/core/target/appassembler/lib/sesame-rio-trix-2.6.1.jar>
[INFO] Installing /home/jenkins/.m2/repository/org/openrdf/sesame/sesame-repository-sail/2.6.1/sesame-repository-sail-2.6.1.jar
to <https://builds.apache.org/job/Any23-trunk/ws/core/target/appassembler/lib/sesame-repository-sail-2.6.1.jar>
[INFO] Installing /home/jenkins/.m2/repository/org/openrdf/sesame/sesame-sail-api/2.6.1/sesame-sail-api-2.6.1.jar
to <https://builds.apache.org/job/Any23-trunk/ws/core/target/appassembler/lib/sesame-sail-api-2.6.1.jar>
[INFO] Installing /home/jenkins/.m2/repository/org/openrdf/sesame/sesame-queryparser-api/2.6.1/sesame-queryparser-api-2.6.1.jar
to <https://builds.apache.org/job/Any23-trunk/ws/core/target/appassembler/lib/sesame-queryparser-api-2.6.1.jar>
[INFO] Installing /home/jenkins/.m2/repository/org/openrdf/sesame/sesame-queryalgebra-model/2.6.1/sesame-queryalgebra-model-2.6.1.jar
to <https://builds.apache.org/job/Any23-trunk/ws/core/target/appassembler/lib/sesame-queryalgebra-model-2.6.1.jar>
[INFO] Installing /home/jenkins/.m2/repository/org/openrdf/sesame/sesame-query/2.6.1/sesame-query-2.6.1.jar
to <https://builds.apache.org/job/Any23-trunk/ws/core/target/appassembler/lib/sesame-query-2.6.1.jar>
[INFO] Installing /home/jenkins/.m2/repository/org/openrdf/sesame/sesame-sail-memory/2.6.1/sesame-sail-memory-2.6.1.jar
to <https://builds.apache.org/job/Any23-trunk/ws/core/target/appassembler/lib/sesame-sail-memory-2.6.1.jar>
[INFO] Installing /home/jenkins/.m2/repository/org/openrdf/sesame/sesame-sail-inferencer/2.6.1/sesame-sail-inferencer-2.6.1.jar
to <https://builds.apache.org/job/Any23-trunk/ws/core/target/appassembler/lib/sesame-sail-inferencer-2.6.1.jar>
[INFO] Installing /home/jenkins/.m2/repository/org/openrdf/sesame/sesame-queryparser-serql/2.6.1/sesame-queryparser-serql-2.6.1.jar
to <https://builds.apache.org/job/Any23-trunk/ws/core/target/appassembler/lib/sesame-queryparser-serql-2.6.1.jar>
[INFO] Installing /home/jenkins/.m2/repository/org/openrdf/sesame/sesame-queryalgebra-evaluation/2.6.1/sesame-queryalgebra-evaluation-2.6.1.jar
to <https://builds.apache.org/job/Any23-trunk/ws/core/target/appassembler/lib/sesame-queryalgebra-evaluation-2.6.1.jar>
[INFO] Installing /home/jenkins/.m2/repository/org/openrdf/sesame/sesame-repository-sparql/2.6.1/sesame-repository-sparql-2.6.1.jar
to <https://builds.apache.org/job/Any23-trunk/ws/core/target/appassembler/lib/sesame-repository-sparql-2.6.1.jar>
[INFO] Installing /home/jenkins/.m2/repository/org/openrdf/sesame/sesame-http-client/2.6.1/sesame-http-client-2.6.1.jar
to <https://builds.apache.org/job/Any23-trunk/ws/core/target/appassembler/lib/sesame-http-client-2.6.1.jar>
[INFO] Installing /home/jenkins/.m2/repository/org/openrdf/sesame/sesame-http-protocol/2.6.1/sesame-http-protocol-2.6.1.jar
to <https://builds.apache.org/job/Any23-trunk/ws/core/target/appassembler/lib/sesame-http-protocol-2.6.1.jar>
[INFO] Installing /home/jenkins/.m2/repository/org/openrdf/sesame/sesame-queryresultio-api/2.6.1/sesame-queryresultio-api-2.6.1.jar
to <https://builds.apache.org/job/Any23-trunk/ws/core/target/appassembler/lib/sesame-queryresultio-api-2.6.1.jar>
[INFO] Installing /home/jenkins/.m2/repository/org/openrdf/sesame/sesame-queryresultio-sparqlxml/2.6.1/sesame-queryresultio-sparqlxml-2.6.1.jar
to <https://builds.apache.org/job/Any23-trunk/ws/core/target/appassembler/lib/sesame-queryresultio-sparqlxml-2.6.1.jar>
[INFO] Installing /home/jenkins/.m2/repository/org/openrdf/sesame/sesame-repository-api/2.6.1/sesame-repository-api-2.6.1.jar
to <https://builds.apache.org/job/Any23-trunk/ws/core/target/appassembler/lib/sesame-repository-api-2.6.1.jar>
[INFO] Installing /home/jenkins/.m2/repository/info/aduna/commons/aduna-commons-xml/2.7.0/aduna-commons-xml-2.7.0.jar
to <https://builds.apache.org/job/Any23-trunk/ws/core/target/appassembler/lib/aduna-commons-xml-2.7.0.jar>
[INFO] Installing /home/jenkins/.m2/repository/info/aduna/commons/aduna-commons-text/2.7.0/aduna-commons-text-2.7.0.jar
to <https://builds.apache.org/job/Any23-trunk/ws/core/target/appassembler/lib/aduna-commons-text-2.7.0.jar>
[INFO] Installing /home/jenkins/.m2/repository/info/aduna/commons/aduna-commons-net/2.7.0/aduna-commons-net-2.7.0.jar
to <https://builds.apache.org/job/Any23-trunk/ws/core/target/appassembler/lib/aduna-commons-net-2.7.0.jar>
[INFO] Installing /home/jenkins/.m2/repository/info/aduna/commons/aduna-commons-lang/2.9.0/aduna-commons-lang-2.9.0.jar
to <https://builds.apache.org/job/Any23-trunk/ws/core/target/appassembler/lib/aduna-commons-lang-2.9.0.jar>
[INFO] Installing /home/jenkins/.m2/repository/info/aduna/commons/aduna-commons-iteration/2.10.0/aduna-commons-iteration-2.10.0.jar
to <https://builds.apache.org/job/Any23-trunk/ws/core/target/appassembler/lib/aduna-commons-iteration-2.10.0.jar>
[INFO] Installing /home/jenkins/.m2/repository/info/aduna/commons/aduna-commons-io/2.10.0/aduna-commons-io-2.10.0.jar
to <https://builds.apache.org/job/Any23-trunk/ws/core/target/appassembler/lib/aduna-commons-io-2.10.0.jar>
[INFO] Installing /home/jenkins/.m2/repository/info/aduna/commons/aduna-commons-concurrent/2.7.0/aduna-commons-concurrent-2.7.0.jar
to <https://builds.apache.org/job/Any23-trunk/ws/core/target/appassembler/lib/aduna-commons-concurrent-2.7.0.jar>
[INFO] Installing /home/jenkins/.m2/repository/org/apache/commons/commons-csv/1.0-SNAPSHOT-rev1148315/commons-csv-1.0-SNAPSHOT-rev1148315.jar
to <https://builds.apache.org/job/Any23-trunk/ws/core/target/appassembler/lib/commons-csv-1.0-SNAPSHOT-rev1148315.jar>
[INFO] Installing /home/jenkins/.m2/repository/org/slf4j/slf4j-api/1.5.6/slf4j-api-1.5.6.jar
to <https://builds.apache.org/job/Any23-trunk/ws/core/target/appassembler/lib/slf4j-api-1.5.6.jar>
[INFO] Installing /home/jenkins/.m2/repository/org/slf4j/slf4j-jdk14/1.5.6/slf4j-jdk14-1.5.6.jar
to <https://builds.apache.org/job/Any23-trunk/ws/core/target/appassembler/lib/slf4j-jdk14-1.5.6.jar>
[INFO] Installing /home/jenkins/.m2/repository/org/slf4j/jcl-over-slf4j/1.5.6/jcl-over-slf4j-1.5.6.jar
to <https://builds.apache.org/job/Any23-trunk/ws/core/target/appassembler/lib/jcl-over-slf4j-1.5.6.jar>
[INFO] Installing <https://builds.apache.org/job/Any23-trunk/ws/core/target/any23-core-0.6.2-incubating-SNAPSHOT.jar>
to <https://builds.apache.org/job/Any23-trunk/ws/core/target/appassembler/lib/any23-core-0.6.2-incubating-SNAPSHOT.jar>
[INFO] 
[INFO] --- maven-assembly-plugin:2.2.2:single (assembly) @ any23-core ---
[INFO] Reading assembly descriptor: <https://builds.apache.org/job/Any23-trunk/ws/core/src/main/assembly/bin.xml>
[INFO] Building tar : <https://builds.apache.org/job/Any23-trunk/ws/core/target/apache-any23-core-0.6.2-incubating-SNAPSHOT.tar.gz>
[INFO] Building zip: <https://builds.apache.org/job/Any23-trunk/ws/core/target/apache-any23-core-0.6.2-incubating-SNAPSHOT.zip>
[INFO] Installing <https://builds.apache.org/job/Any23-trunk/ws/core/target/any23-core-0.6.2-incubating-SNAPSHOT.jar>
to /home/jenkins/.m2/repository/org/apache/any23/any23-core/0.6.2-incubating-SNAPSHOT/any23-core-0.6.2-incubating-SNAPSHOT.jar
[INFO] [INFO] Installing <https://builds.apache.org/job/Any23-trunk/ws/core/pom.xml>
to /home/jenkins/.m2/repository/org/apache/any23/any23-core/0.6.2-incubating-SNAPSHOT/any23-core-0.6.2-incubating-SNAPSHOT.pom

[INFO] --- maven-install-plugin:2.3.1:install (default-install) @ any23-core ---
[JENKINS] Archiving <https://builds.apache.org/job/Any23-trunk/ws/core/pom.xml> to /home/hudson/hudson/jobs/Any23-trunk/modules/org.apache.any23$any23-core/builds/2012-01-14_07-01-51/archive/org.apache.any23/any23-core/0.6.2-incubating-SNAPSHOT/any23-core-0.6.2-incubating-SNAPSHOT.pom
[JENKINS] Archiving <https://builds.apache.org/job/Any23-trunk/ws/core/target/any23-core-0.6.2-incubating-SNAPSHOT.jar>
to /home/hudson/hudson/jobs/Any23-trunk/modules/org.apache.any23$any23-core/builds/2012-01-14_07-01-51/archive/org.apache.any23/any23-core/0.6.2-incubating-SNAPSHOT/any23-core-0.6.2-incubating-SNAPSHOT.jar
[INFO]                                                                         
[INFO] ------------------------------------------------------------------------
[INFO] Building Apache Any23 :: Plugins :: Basic Crawler 1.0.0-incubating-SNAPSHOT
[INFO] ------------------------------------------------------------------------
[INFO] Checking for local modifications: skipped.
[INFO] [INFO] Updating project files from SCM: skipped.
[INFO] Executing: /bin/sh -c cd <https://builds.apache.org/job/Any23-trunk/ws/plugins/basic-crawler>
&& svn --non-interactive info
[INFO] Working directory: <https://builds.apache.org/job/Any23-trunk/ws/plugins/basic-crawler>
[INFO] Storing buildNumber: 1231435 at timestamp: 1326525345697
[INFO] Executing: /bin/sh -c cd <https://builds.apache.org/job/Any23-trunk/ws/plugins/basic-crawler>
&& svn --non-interactive info
[INFO] Working directory: <https://builds.apache.org/job/Any23-trunk/ws/plugins/basic-crawler>
[INFO] Storing buildScmBranch: trunk

[INFO] --- buildnumber-maven-plugin:1.0:create (default) @ any23-basic-crawler ---
[INFO] 
[INFO] --- maven-remote-resources-plugin:1.2.1:process (default) @ any23-basic-crawler ---
[INFO] [debug] execute contextualize
[INFO] Using 'UTF-8' encoding to copy filtered resources.
[INFO] Copying 3 resources to META-INF
[INFO] Copying 3 resources

[INFO] --- maven-resources-plugin:2.5:resources (default-resources) @ any23-basic-crawler
---
[INFO] 
[INFO] --- maven-compiler-plugin:2.3.2:compile (default-compile) @ any23-basic-crawler ---
[INFO] Compiling 6 source files to <https://builds.apache.org/job/Any23-trunk/ws/plugins/basic-crawler/target/classes>
[debug] execute contextualize
[INFO] [INFO] Using 'UTF-8' encoding to copy filtered resources.
[INFO] skip non existing resourceDirectory <https://builds.apache.org/job/Any23-trunk/ws/plugins/basic-crawler/src/test/resources>
[INFO] Copying 3 resources

[INFO] --- maven-resources-plugin:2.5:testResources (default-testResources) @ any23-basic-crawler
---
[INFO] 
[INFO] --- maven-compiler-plugin:2.3.2:testCompile (default-testCompile) @ any23-basic-crawler
---
[INFO] Compiling 3 source files to <https://builds.apache.org/job/Any23-trunk/ws/plugins/basic-crawler/target/test-classes>
[INFO] [INFO] Surefire report directory: <https://builds.apache.org/job/Any23-trunk/ws/plugins/basic-crawler/target/surefire-reports>

-------------------------------------------------------
 T E S T S
-------------------------------------------------------

[INFO] --- maven-surefire-plugin:2.9:test (default-test) @ any23-basic-crawler ---

-------------------------------------------------------
 T E S T S
-------------------------------------------------------
Running org.deri.any23.plugin.crawler.SiteCrawlerTest
Deleting content of: /tmp/site-crawler-test6977851875966349863.storage/frontier
WARNING: Could not find crawler4j.properties file in class path. I will use the default values.
log4j:WARN No appenders could be found for logger (edu.uci.ics.crawler4j.crawler.CrawlController).
log4j:WARN Please initialize the log4j system properly.
Tests run: 1, Failures: 0, Errors: 0, Skipped: 0, Time elapsed: 15.494 sec
Running org.deri.any23.cli.CrawlerTest
Deleting content of: /tmp/crawler-metadata-28e19061-0e14-4631-8427-4e5287a85df24119717397469044516db/frontier
WARNING: Could not find crawler4j.properties file in class path. I will use the default values.
log4j:WARN No appenders could be found for logger (edu.uci.ics.crawler4j.crawler.CrawlController).
log4j:WARN Please initialize the log4j system properly.
Processing page: [http://eventiesagre.it/]
Processing page: [http://eventiesagre.it/Natale_Natale/12828_Natale+a+Torino.html]
Processing page: [http://eventiesagre.it/Eventi_Musicali/21066277_Chakra+Lounge+Spiritual+Taste.html]
Processing page: [http://eventiesagre.it/Natale_Natale/4261_Natale+a+Modena.html]
Processing page: [http://eventiesagre.it/Eventi_Culturali/21066532_La+Civilta+dell+Amore.html]
Processing page: [http://eventiesagre.it/Itinerari/elenco.html]
Processing page: [http://eventiesagre.it/Eventi_Mostre/21066502_Cervello.html]
Tests run: 1, Failures: 0, Errors: 0, Skipped: 0, Time elapsed: 10.098 sec
Total Documents: 7, Total Triples: 255

Results :

Tests run: 2, Failures: 0, Errors: 0, Skipped: 0

[JENKINS] Recording test results
[INFO] [INFO] Building jar: <https://builds.apache.org/job/Any23-trunk/ws/plugins/basic-crawler/target/any23-basic-crawler-1.0.0-incubating-SNAPSHOT.jar>

[INFO] --- maven-jar-plugin:2.3.1:jar (default-jar) @ any23-basic-crawler ---
[INFO] 
[INFO] --- maven-site-plugin:3.0:attach-descriptor (attach-descriptor) @ any23-basic-crawler
---
[INFO] Installing <https://builds.apache.org/job/Any23-trunk/ws/plugins/basic-crawler/target/any23-basic-crawler-1.0.0-incubating-SNAPSHOT.jar>
to /home/jenkins/.m2/repository/org/apache/any23/plugin/any23-basic-crawler/1.0.0-incubating-SNAPSHOT/any23-basic-crawler-1.0.0-incubating-SNAPSHOT.jar
[INFO] [INFO] Installing <https://builds.apache.org/job/Any23-trunk/ws/plugins/basic-crawler/pom.xml>
to /home/jenkins/.m2/repository/org/apache/any23/plugin/any23-basic-crawler/1.0.0-incubating-SNAPSHOT/any23-basic-crawler-1.0.0-incubating-SNAPSHOT.pom

[INFO] --- maven-install-plugin:2.3.1:install (default-install) @ any23-basic-crawler ---
[JENKINS] Archiving <https://builds.apache.org/job/Any23-trunk/ws/plugins/basic-crawler/pom.xml>
to /home/hudson/hudson/jobs/Any23-trunk/modules/org.apache.any23.plugin$any23-basic-crawler/builds/2012-01-14_07-01-51/archive/org.apache.any23.plugin/any23-basic-crawler/1.0.0-incubating-SNAPSHOT/any23-basic-crawler-1.0.0-incubating-SNAPSHOT.pom
[JENKINS] Archiving <https://builds.apache.org/job/Any23-trunk/ws/plugins/basic-crawler/target/any23-basic-crawler-1.0.0-incubating-SNAPSHOT.jar>
to /home/hudson/hudson/jobs/Any23-trunk/modules/org.apache.any23.plugin$any23-basic-crawler/builds/2012-01-14_07-01-51/archive/org.apache.any23.plugin/any23-basic-crawler/1.0.0-incubating-SNAPSHOT/any23-basic-crawler-1.0.0-incubating-SNAPSHOT.jar
[INFO] Downloading: http://download.java.net/maven/2/org/deri/any23/any23-core/0.6.2-incubating-SNAPSHOT/maven-metadata.xml
Downloading: http://mirrors.ibiblio.org/pub/mirrors/maven2/org/deri/any23/any23-core/0.6.2-incubating-SNAPSHOT/maven-metadata.xml
Downloading: http://any23.googlecode.com/svn/repo-ext/org/deri/any23/any23-core/0.6.2-incubating-SNAPSHOT/maven-metadata.xml
Downloading: http://repo.aduna-software.org/maven2/releases/org/deri/any23/any23-core/0.6.2-incubating-SNAPSHOT/maven-metadata.xml
                                                                        
[INFO] ------------------------------------------------------------------------
[INFO] Building Apache Any23 :: Plugins :: HTML Scraper 1.0.1-incubating-SNAPSHOT
[INFO] ------------------------------------------------------------------------
Downloading: https://repository.apache.org/content/groups/public/org/deri/any23/any23-core/0.6.2-incubating-SNAPSHOT/maven-metadata.xml
Downloading: https://repository.apache.org/content/repositories/releases/org/deri/any23/any23-core/0.6.2-incubating-SNAPSHOT/maven-metadata.xml
Downloading: http://repository.apache.org/snapshots/org/deri/any23/any23-core/0.6.2-incubating-SNAPSHOT/maven-metadata.xml
Downloading: http://any23.googlecode.com/svn/repo-ext/org/deri/any23/any23-core/0.6.2-incubating-SNAPSHOT/any23-core-0.6.2-incubating-SNAPSHOT.pom
Downloading: http://repo.aduna-software.org/maven2/releases/org/deri/any23/any23-core/0.6.2-incubating-SNAPSHOT/any23-core-0.6.2-incubating-SNAPSHOT.pom
Downloading: http://mirrors.ibiblio.org/pub/mirrors/maven2/org/deri/any23/any23-core/0.6.2-incubating-SNAPSHOT/any23-core-0.6.2-incubating-SNAPSHOT.pom
Downloading: http://download.java.net/maven/2/org/deri/any23/any23-core/0.6.2-incubating-SNAPSHOT/any23-core-0.6.2-incubating-SNAPSHOT.pom
Downloading: https://repository.apache.org/content/groups/public/org/deri/any23/any23-core/0.6.2-incubating-SNAPSHOT/any23-core-0.6.2-incubating-SNAPSHOT.pom
Downloading: https://repository.apache.org/content/repositories/releases/org/deri/any23/any23-core/0.6.2-incubating-SNAPSHOT/any23-core-0.6.2-incubating-SNAPSHOT.pom
Downloading: http://repository.apache.org/snapshots/org/deri/any23/any23-core/0.6.2-incubating-SNAPSHOT/any23-core-0.6.2-incubating-SNAPSHOT.pom
[WARNING] The POM for org.deri.any23:any23-core:jar:0.6.2-incubating-SNAPSHOT is missing,
no dependency information available
Downloading: http://any23.googlecode.com/svn/repo-ext/org/deri/any23/any23-core/0.6.2-incubating-SNAPSHOT/any23-core-0.6.2-incubating-SNAPSHOT.jar
Downloading: http://repo.aduna-software.org/maven2/releases/org/deri/any23/any23-core/0.6.2-incubating-SNAPSHOT/any23-core-0.6.2-incubating-SNAPSHOT.jar
Downloading: http://mirrors.ibiblio.org/pub/mirrors/maven2/org/deri/any23/any23-core/0.6.2-incubating-SNAPSHOT/any23-core-0.6.2-incubating-SNAPSHOT.jar
Downloading: http://download.java.net/maven/2/org/deri/any23/any23-core/0.6.2-incubating-SNAPSHOT/any23-core-0.6.2-incubating-SNAPSHOT.jar
Downloading: https://repository.apache.org/content/groups/public/org/deri/any23/any23-core/0.6.2-incubating-SNAPSHOT/any23-core-0.6.2-incubating-SNAPSHOT.jar
Downloading: https://repository.apache.org/content/repositories/releases/org/deri/any23/any23-core/0.6.2-incubating-SNAPSHOT/any23-core-0.6.2-incubating-SNAPSHOT.jar
Downloading: http://repository.apache.org/snapshots/org/deri/any23/any23-core/0.6.2-incubating-SNAPSHOT/any23-core-0.6.2-incubating-SNAPSHOT.jar
[JENKINS] Archiving <https://builds.apache.org/job/Any23-trunk/ws/plugins/html-scraper/pom.xml>
to /home/hudson/hudson/jobs/Any23-trunk/modules/org.apache.any23.plugin$any23-html-scraper/builds/2012-01-14_07-01-51/archive/org.apache.any23.plugin/any23-html-scraper/1.0.1-incubating-SNAPSHOT/any23-html-scraper-1.0.1-incubating-SNAPSHOT.pom
[INFO] ------------------------------------------------------------------------
[INFO] Reactor Summary:
[INFO] 
[INFO] Apache Any23 :: Parent ............................ SUCCESS [7:08.994s]
[INFO] Apache Any23 :: Core .............................. SUCCESS [2:45.265s]
[INFO] Apache Any23 :: Plugins :: Basic Crawler .......... SUCCESS [36.130s]
[INFO] Apache Any23 :: Plugins :: HTML Scraper ........... FAILURE [6.364s]
[INFO] Apache Any23 :: Plugins :: Office Scraper ......... SKIPPED
[INFO] Apache Any23 :: Plugins :: Integration Test ....... SKIPPED
[INFO] Apache Any23 :: Service ........................... SKIPPED
[INFO] ------------------------------------------------------------------------
[INFO] BUILD FAILURE
[INFO] ------------------------------------------------------------------------
[INFO] Total time: 12:06.715s
[INFO] Finished at: Sat Jan 14 07:16:33 UTC 2012
[INFO] Final Memory: 43M/165M
[INFO] ------------------------------------------------------------------------
mavenExecutionResult exceptions not empty
message : Failed to execute goal on project any23-html-scraper: Could not resolve dependencies
for project org.apache.any23.plugin:any23-html-scraper:jar:1.0.1-incubating-SNAPSHOT: Could
not find artifact org.deri.any23:any23-core:jar:0.6.2-incubating-SNAPSHOT in any23-repository-external
(http://any23.googlecode.com/svn/repo-ext)
cause : Could not resolve dependencies for project org.apache.any23.plugin:any23-html-scraper:jar:1.0.1-incubating-SNAPSHOT:
Could not find artifact org.deri.any23:any23-core:jar:0.6.2-incubating-SNAPSHOT in any23-repository-external
(http://any23.googlecode.com/svn/repo-ext)
Stack trace : 
org.apache.maven.lifecycle.LifecycleExecutionException: Failed to execute goal on project
any23-html-scraper: Could not resolve dependencies for project org.apache.any23.plugin:any23-html-scraper:jar:1.0.1-incubating-SNAPSHOT:
Could not find artifact org.deri.any23:any23-core:jar:0.6.2-incubating-SNAPSHOT in any23-repository-external
(http://any23.googlecode.com/svn/repo-ext)
	at org.apache.maven.lifecycle.internal.LifecycleDependencyResolver.getDependencies(LifecycleDependencyResolver.java:196)
	at org.apache.maven.lifecycle.internal.LifecycleDependencyResolver.resolveProjectDependencies(LifecycleDependencyResolver.java:108)
	at org.apache.maven.lifecycle.internal.MojoExecutor.ensureDependenciesAreResolved(MojoExecutor.java:258)
	at org.apache.maven.lifecycle.internal.MojoExecutor.execute(MojoExecutor.java:201)
	at org.apache.maven.lifecycle.internal.MojoExecutor.execute(MojoExecutor.java:153)
	at org.apache.maven.lifecycle.internal.MojoExecutor.execute(MojoExecutor.java:145)
	at org.apache.maven.lifecycle.internal.LifecycleModuleBuilder.buildProject(LifecycleModuleBuilder.java:84)
	at org.apache.maven.lifecycle.internal.LifecycleModuleBuilder.buildProject(LifecycleModuleBuilder.java:59)
	at org.apache.maven.lifecycle.internal.LifecycleStarter.singleThreadedBuild(LifecycleStarter.java:183)
	at org.apache.maven.lifecycle.internal.LifecycleStarter.execute(LifecycleStarter.java:161)
	at org.apache.maven.DefaultMaven.doExecute(DefaultMaven.java:319)
	at org.apache.maven.DefaultMaven.execute(DefaultMaven.java:156)
	at org.jvnet.hudson.maven3.launcher.Maven3Launcher.main(Maven3Launcher.java:79)
	at sun.reflect.NativeMethodAccessorImpl.invoke0(Native Method)
	at sun.reflect.NativeMethodAccessorImpl.invoke(NativeMethodAccessorImpl.java:39)
	at sun.reflect.DelegatingMethodAccessorImpl.invoke(DelegatingMethodAccessorImpl.java:25)
	at java.lang.reflect.Method.invoke(Method.java:597)
	at org.codehaus.plexus.classworlds.launcher.Launcher.launchStandard(Launcher.java:329)
	at org.codehaus.plexus.classworlds.launcher.Launcher.launch(Launcher.java:239)
	at org.jvnet.hudson.maven3.agent.Maven3Main.launch(Maven3Main.java:158)
	at hudson.maven.Maven3Builder.call(Maven3Builder.java:104)
	at hudson.maven.Maven3Builder.call(Maven3Builder.java:70)
	at hudson.remoting.UserRequest.perform(UserRequest.java:118)
	at hudson.remoting.UserRequest.perform(UserRequest.java:48)
	at hudson.remoting.Request$2.run(Request.java:287)
	at java.util.concurrent.Executors$RunnableAdapter.call(Executors.java:441)
	at java.util.concurrent.FutureTask$Sync.innerRun(FutureTask.java:303)
	at java.util.concurrent.FutureTask.run(FutureTask.java:138)
	at java.util.concurrent.ThreadPoolExecutor$Worker.runTask(ThreadPoolExecutor.java:886)
	at java.util.concurrent.ThreadPoolExecutor$Worker.run(ThreadPoolExecutor.java:908)
	at java.lang.Thread.run(Thread.java:662)
Caused by: org.apache.maven.project.DependencyResolutionException: Could not resolve dependencies
for project org.apache.any23.plugin:any23-html-scraper:jar:1.0.1-incubating-SNAPSHOT: Could
not find artifact org.deri.any23:any23-core:jar:0.6.2-incubating-SNAPSHOT in any23-repository-external
(http://any23.googlecode.com/svn/repo-ext)
	at org.apache.maven.project.DefaultProjectDependenciesResolver.resolve(DefaultProjectDependenciesResolver.java:170)
	at org.apache.maven.lifecycle.internal.LifecycleDependencyResolver.getDependencies(LifecycleDependencyResolver.java:171)
	... 30 more
Caused by: org.sonatype.aether.resolution.DependencyResolutionException: Could not find artifact
org.deri.any23:any23-core:jar:0.6.2-incubating-SNAPSHOT in any23-repository-external (http://any23.googlecode.com/svn/repo-ext)
	at org.sonatype.aether.impl.internal.DefaultRepositorySystem.resolveDependencies(DefaultRepositorySystem.java:412)
	at org.apache.maven.project.DefaultProjectDependenciesResolver.resolve(DefaultProjectDependenciesResolver.java:164)
	... 31 more
Caused by: org.sonatype.aether.resolution.ArtifactResolutionException: Could not find artifact
org.deri.any23:any23-core:jar:0.6.2-incubating-SNAPSHOT in any23-repository-external (http://any23.googlecode.com/svn/repo-ext)
	at org.sonatype.aether.impl.internal.DefaultArtifactResolver.resolve(DefaultArtifactResolver.java:541)
	at org.sonatype.aether.impl.internal.DefaultArtifactResolver.resolveArtifacts(DefaultArtifactResolver.java:220)
	at org.sonatype.aether.impl.internal.DefaultRepositorySystem.resolveDependencies(DefaultRepositorySystem.java:395)
	... 32 more
Caused by: org.sonatype.aether.transfer.ArtifactNotFoundException: Could not find artifact
org.deri.any23:any23-core:jar:0.6.2-incubating-SNAPSHOT in any23-repository-external (http://any23.googlecode.com/svn/repo-ext)
	at org.sonatype.aether.connector.wagon.WagonRepositoryConnector$4.wrap(WagonRepositoryConnector.java:945)
	at org.sonatype.aether.connector.wagon.WagonRepositoryConnector$4.wrap(WagonRepositoryConnector.java:940)
	at org.sonatype.aether.connector.wagon.WagonRepositoryConnector$GetTask.flush(WagonRepositoryConnector.java:695)
	at org.sonatype.aether.connector.wagon.WagonRepositoryConnector$GetTask.flush(WagonRepositoryConnector.java:689)
	at org.sonatype.aether.connector.wagon.WagonRepositoryConnector.get(WagonRepositoryConnector.java:445)
	at org.sonatype.aether.impl.internal.DefaultArtifactResolver.resolve(DefaultArtifactResolver.java:460)
	... 34 more
Sending e-mails to: any23-dev@incubator.apache.org simone.tripodi@gmail.com
channel stopped
Updating ANY23-32


Mime
View raw message