incubator-allura-dev mailing list archives

Site index · List index
Message view « Date » · « Thread »
Top « Date » · « Thread »
From Dave Brondsema <d...@brondsema.net>
Subject Re: Tests failures by timeout
Date Wed, 05 Feb 2014 16:36:22 GMT
Assuming that it got hung where you control-C'd, then the zarkov event is to
blame.  Zarkov events should be an optional, but it seems that the code just
checks to see if the 'zmq' lib is installed and it should really be checking to
see if zarkov.host is configured.

Could you try uninstalling zmq, or change app_globals.py line 338 `if not zmq:`
to just always return even if zmq is available?  If that fixes the timeout, then
we'll know this is the issue, and can make a proper fix.

On 2/5/14 3:46 AM, Igor Bondarenko wrote:
> I don't think this is the issue with multiproc plugin. I've tried to run
> tests only in Allura app and found that they consistently hang in some
> point. That's why timeout is reached.  After pressing Ctrl+C  I've got the
> following traceback. I've tried to reinstall requirements,
> ./rebuild-all.sh, remove all *.pyc files, but nothing helps.
> 
> (in Allura dir) $ nosetests
> ....................................... ^CEntering post-mortem PDB shell
> Traceback (most recent call last):
>   File "/home/jetmind/.virtualenvs/allura/bin/nosetests", line 9, in
> <module>
>     load_entry_point('nose==1.3.0', 'console_scripts', 'nosetests')()
>   File
> "/home/jetmind/.virtualenvs/allura/local/lib/python2.7/site-packages/nose/core.py",
> line 118, in __init__
>     **extra_args)
>   File "/usr/lib/python2.7/unittest/main.py", line 95, in __init__
>     self.runTests()
>   File
> "/home/jetmind/.virtualenvs/allura/local/lib/python2.7/site-packages/nose/core.py",
> line 197, in runTests
>     result = self.testRunner.run(self.test)
>   File
> "/home/jetmind/.virtualenvs/allura/local/lib/python2.7/site-packages/nose/core.py",
> line 61, in run
>     test(result)
>   File
> "/home/jetmind/.virtualenvs/allura/local/lib/python2.7/site-packages/nose/suite.py",
> line 176, in __call__
>     return self.run(*arg, **kw)
>   File
> "/home/jetmind/.virtualenvs/allura/local/lib/python2.7/site-packages/nose/suite.py",
> line 223, in run
>     test(orig)
>   File "/usr/lib/python2.7/unittest/suite.py", line 70, in __call__
>     return self.run(*args, **kwds)
>   File
> "/home/jetmind/.virtualenvs/allura/local/lib/python2.7/site-packages/nose/suite.py",
> line 74, in run
>     test(result)
>   File
> "/home/jetmind/.virtualenvs/allura/local/lib/python2.7/site-packages/nose/suite.py",
> line 176, in __call__
>     return self.run(*arg, **kw)
>   File
> "/home/jetmind/.virtualenvs/allura/local/lib/python2.7/site-packages/nose/suite.py",
> line 223, in run
>     test(orig)
>   File
> "/home/jetmind/.virtualenvs/allura/local/lib/python2.7/site-packages/nose/suite.py",
> line 176, in __call__
>     return self.run(*arg, **kw)
>   File
> "/home/jetmind/.virtualenvs/allura/local/lib/python2.7/site-packages/nose/suite.py",
> line 223, in run
>     test(orig)
>   File
> "/home/jetmind/.virtualenvs/allura/local/lib/python2.7/site-packages/nose/suite.py",
> line 176, in __call__
>     return self.run(*arg, **kw)
>   File
> "/home/jetmind/.virtualenvs/allura/local/lib/python2.7/site-packages/nose/suite.py",
> line 223, in run
>     test(orig)
>   File
> "/home/jetmind/.virtualenvs/allura/local/lib/python2.7/site-packages/nose/suite.py",
> line 176, in __call__
>     return self.run(*arg, **kw)
>   File
> "/home/jetmind/.virtualenvs/allura/local/lib/python2.7/site-packages/nose/suite.py",
> line 223, in run
>     test(orig)
>   File
> "/home/jetmind/.virtualenvs/allura/local/lib/python2.7/site-packages/nose/suite.py",
> line 176, in __call__
>     return self.run(*arg, **kw)
>   File
> "/home/jetmind/.virtualenvs/allura/local/lib/python2.7/site-packages/nose/suite.py",
> line 223, in run
>     test(orig)
>   File
> "/home/jetmind/.virtualenvs/allura/local/lib/python2.7/site-packages/nose/case.py",
> line 45, in __call__
>     return self.run(*arg, **kwarg)
>   File
> "/home/jetmind/.virtualenvs/allura/local/lib/python2.7/site-packages/nose/case.py",
> line 133, in run
>     self.runTest(result)
>   File
> "/home/jetmind/.virtualenvs/allura/local/lib/python2.7/site-packages/nose/case.py",
> line 151, in runTest
>     test(result)
>   File "/usr/lib/python2.7/unittest/case.py", line 396, in __call__
>     return self.run(*args, **kwds)
>   File "/usr/lib/python2.7/unittest/case.py", line 323, in run
>     self.setUp()
>   File
> "/home/jetmind/.virtualenvs/allura/local/lib/python2.7/site-packages/nose/case.py",
> line 381, in setUp
>     try_run(self.inst, ('setup', 'setUp'))
>   File
> "/home/jetmind/.virtualenvs/allura/local/lib/python2.7/site-packages/nose/util.py",
> line 469, in try_run
>     return func()
>   File
> "/home/jetmind/p/42cc/allura/sourceforge-allura/AlluraTest/alluratest/controller.py",
> line 129, in setUp
>     setup_functional_test(app_name=self.application_under_test))
>   File
> "/home/jetmind/p/42cc/allura/sourceforge-allura/AlluraTest/alluratest/controller.py",
> line 83, in setup_functional_test
>     setup_basic_test(config, app_name)
>   File
> "/home/jetmind/p/42cc/allura/sourceforge-allura/AlluraTest/alluratest/controller.py",
> line 72, in setup_basic_test
>     cmd.run([test_file])
>   File
> "/home/jetmind/.virtualenvs/allura/local/lib/python2.7/site-packages/paste/script/appinstall.py",
> line 68, in run
>     return super(AbstractInstallCommand, self).run(new_args)
>   File
> "/home/jetmind/.virtualenvs/allura/local/lib/python2.7/site-packages/paste/script/command.py",
> line 238, in run
>     result = self.command()
>   File
> "/home/jetmind/.virtualenvs/allura/local/lib/python2.7/site-packages/paste/script/appinstall.py",
> line 456, in command
>     self, config_file, section, self.sysconfig_install_vars(installer))
>   File
> "/home/jetmind/.virtualenvs/allura/local/lib/python2.7/site-packages/paste/script/appinstall.py",
> line 598, in setup_config
>     mod.setup_app, command, filename, section, vars)
>   File
> "/home/jetmind/.virtualenvs/allura/local/lib/python2.7/site-packages/paste/script/appinstall.py",
> line 614, in _call_setup_app
>     func(command, conf, vars)
>   File
> "/home/jetmind/p/42cc/allura/sourceforge-allura/Allura/allura/websetup/__init__.py",
> line 38, in setup_app
>     bootstrap.bootstrap(command, conf, vars)
>   File
> "/home/jetmind/p/42cc/allura/sourceforge-allura/Allura/allura/websetup/bootstrap.py",
> line 131, in bootstrap
>     p_users = project_reg.register_neighborhood_project(n_users, [root])
>   File
> "/home/jetmind/p/42cc/allura/sourceforge-allura/Allura/allura/lib/plugin.py",
> line 468, in register_neighborhood_project
>     ('admin', 'admin', 'Admin')])
>   File
> "/home/jetmind/p/42cc/allura/sourceforge-allura/Allura/allura/model/project.py",
> line 843, in configure_project
>     self.install_app(ep_name, mount_point, label, ordinal=i)
>   File
> "/home/jetmind/p/42cc/allura/sourceforge-allura/Allura/allura/model/project.py",
> line 650, in install_app
>     app.install(self)
>   File
> "/home/jetmind/p/42cc/allura/sourceforge-allura/ForgeWiki/forgewiki/wiki_main.py",
> line 256, in install
>     super(ForgeWikiApp, self).install(project)
>   File
> "/home/jetmind/p/42cc/allura/sourceforge-allura/Allura/allura/app.py", line
> 464, in install
>     session(discussion).flush()
>   File
> "/home/jetmind/.virtualenvs/allura/local/lib/python2.7/site-packages/ming/odm/base.py",
> line 30, in inner
>     call_hook(obj, after_meth, *args, **kwargs)
>   File
> "/home/jetmind/.virtualenvs/allura/local/lib/python2.7/site-packages/ming/odm/base.py",
> line 16, in call_hook
>     getattr(e, hook_name)(*args, **kw)
>   File
> "/home/jetmind/p/42cc/allura/sourceforge-allura/Allura/allura/model/session.py",
> line 75, in after_flush
>     g.zarkov_event('create', extra=obj.index_id())
>   File
> "/home/jetmind/p/42cc/allura/sourceforge-allura/Allura/allura/lib/app_globals.py",
> line 365, in zarkov_event
>     self._zarkov.event(event_type, context, extra)
>   File
> "/home/jetmind/p/42cc/allura/sourceforge-allura/Allura/allura/lib/zarkov_helpers.py",
> line 38, in event
>     self._sock.send(bson.BSON.encode(obj))
>   File "socket.pyx", line 530, in zmq.core.socket.Socket.send
> (zmq/core/socket.c:4905)
>   File "socket.pyx", line 577, in zmq.core.socket.Socket.send
> (zmq/core/socket.c:4673)
>   File "socket.pyx", line 174, in zmq.core.socket._send_copy
> (zmq/core/socket.c:1915)
>   File "checkrc.pxd", line 11, in zmq.core.checkrc._check_rc
> (zmq/core/socket.c:5511)
>   File
> "/home/jetmind/.virtualenvs/allura/local/lib/python2.7/site-packages/async/__init__.py",
> line 21, in thread_interrupt_handler
>     prev_handler(signum, frame)
> KeyboardInterrupt
> ^CError in sys.excepthook:
> Traceback (most recent call last):
>   File
> "/home/jetmind/p/42cc/allura/sourceforge-allura/Allura/allura/websetup/bootstrap.py",
> line 336, in pm
>     pdb.post_mortem(tb)
>   File "/usr/lib/python2.7/pdb.py", line 1267, in post_mortem
>     p.interaction(None, t)
>   File "/usr/lib/python2.7/pdb.py", line 210, in interaction
>     self.cmdloop()
>   File "/usr/lib/python2.7/cmd.py", line 130, in cmdloop
>     line = raw_input(self.prompt)
>   File
> "/home/jetmind/.virtualenvs/allura/local/lib/python2.7/site-packages/async/__init__.py",
> line 21, in thread_interrupt_handler
>     prev_handler(signum, frame)
> KeyboardInterrupt
> 
> Original exception was:
> Traceback (most recent call last):
>   File "/home/jetmind/.virtualenvs/allura/bin/nosetests", line 9, in
> <module>
>     load_entry_point('nose==1.3.0', 'console_scripts', 'nosetests')()
>   File
> "/home/jetmind/.virtualenvs/allura/local/lib/python2.7/site-packages/nose/core.py",
> line 118, in __init__
>     **extra_args)
>   File "/usr/lib/python2.7/unittest/main.py", line 95, in __init__
>     self.runTests()
>   File
> "/home/jetmind/.virtualenvs/allura/local/lib/python2.7/site-packages/nose/core.py",
> line 197, in runTests
>     result = self.testRunner.run(self.test)
>   File
> "/home/jetmind/.virtualenvs/allura/local/lib/python2.7/site-packages/nose/core.py",
> line 61, in run
>     test(result)
>   File
> "/home/jetmind/.virtualenvs/allura/local/lib/python2.7/site-packages/nose/suite.py",
> line 176, in __call__
>     return self.run(*arg, **kw)
>   File
> "/home/jetmind/.virtualenvs/allura/local/lib/python2.7/site-packages/nose/suite.py",
> line 223, in run
>     test(orig)
>   File "/usr/lib/python2.7/unittest/suite.py", line 70, in __call__
>     return self.run(*args, **kwds)
>   File
> "/home/jetmind/.virtualenvs/allura/local/lib/python2.7/site-packages/nose/suite.py",
> line 74, in run
>     test(result)
>   File
> "/home/jetmind/.virtualenvs/allura/local/lib/python2.7/site-packages/nose/suite.py",
> line 176, in __call__
>     return self.run(*arg, **kw)
>   File
> "/home/jetmind/.virtualenvs/allura/local/lib/python2.7/site-packages/nose/suite.py",
> line 223, in run
>     test(orig)
>   File
> "/home/jetmind/.virtualenvs/allura/local/lib/python2.7/site-packages/nose/suite.py",
> line 176, in __call__
>     return self.run(*arg, **kw)
>   File
> "/home/jetmind/.virtualenvs/allura/local/lib/python2.7/site-packages/nose/suite.py",
> line 223, in run
>     test(orig)
>   File
> "/home/jetmind/.virtualenvs/allura/local/lib/python2.7/site-packages/nose/suite.py",
> line 176, in __call__
>     return self.run(*arg, **kw)
>   File
> "/home/jetmind/.virtualenvs/allura/local/lib/python2.7/site-packages/nose/suite.py",
> line 223, in run
>     test(orig)
>   File
> "/home/jetmind/.virtualenvs/allura/local/lib/python2.7/site-packages/nose/suite.py",
> line 176, in __call__
>     return self.run(*arg, **kw)
>   File
> "/home/jetmind/.virtualenvs/allura/local/lib/python2.7/site-packages/nose/suite.py",
> line 223, in run
>     test(orig)
>   File
> "/home/jetmind/.virtualenvs/allura/local/lib/python2.7/site-packages/nose/suite.py",
> line 176, in __call__
>     return self.run(*arg, **kw)
>   File
> "/home/jetmind/.virtualenvs/allura/local/lib/python2.7/site-packages/nose/suite.py",
> line 223, in run
>     test(orig)
>   File
> "/home/jetmind/.virtualenvs/allura/local/lib/python2.7/site-packages/nose/case.py",
> line 45, in __call__
>     return self.run(*arg, **kwarg)
>   File
> "/home/jetmind/.virtualenvs/allura/local/lib/python2.7/site-packages/nose/case.py",
> line 133, in run
>     self.runTest(result)
>   File
> "/home/jetmind/.virtualenvs/allura/local/lib/python2.7/site-packages/nose/case.py",
> line 151, in runTest
>     test(result)
>   File "/usr/lib/python2.7/unittest/case.py", line 396, in __call__
>     return self.run(*args, **kwds)
>   File "/usr/lib/python2.7/unittest/case.py", line 323, in run
>     self.setUp()
>   File
> "/home/jetmind/.virtualenvs/allura/local/lib/python2.7/site-packages/nose/case.py",
> line 381, in setUp
>     try_run(self.inst, ('setup', 'setUp'))
>   File
> "/home/jetmind/.virtualenvs/allura/local/lib/python2.7/site-packages/nose/util.py",
> line 469, in try_run
>     return func()
>   File
> "/home/jetmind/p/42cc/allura/sourceforge-allura/AlluraTest/alluratest/controller.py",
> line 129, in setUp
>     setup_functional_test(app_name=self.application_under_test))
>   File
> "/home/jetmind/p/42cc/allura/sourceforge-allura/AlluraTest/alluratest/controller.py",
> line 83, in setup_functional_test
>     setup_basic_test(config, app_name)
>   File
> "/home/jetmind/p/42cc/allura/sourceforge-allura/AlluraTest/alluratest/controller.py",
> line 72, in setup_basic_test
>     cmd.run([test_file])
>   File
> "/home/jetmind/.virtualenvs/allura/local/lib/python2.7/site-packages/paste/script/appinstall.py",
> line 68, in run
>     return super(AbstractInstallCommand, self).run(new_args)
>   File
> "/home/jetmind/.virtualenvs/allura/local/lib/python2.7/site-packages/paste/script/command.py",
> line 238, in run
>     result = self.command()
>   File
> "/home/jetmind/.virtualenvs/allura/local/lib/python2.7/site-packages/paste/script/appinstall.py",
> line 456, in command
>     self, config_file, section, self.sysconfig_install_vars(installer))
>   File
> "/home/jetmind/.virtualenvs/allura/local/lib/python2.7/site-packages/paste/script/appinstall.py",
> line 598, in setup_config
>     mod.setup_app, command, filename, section, vars)
>   File
> "/home/jetmind/.virtualenvs/allura/local/lib/python2.7/site-packages/paste/script/appinstall.py",
> line 614, in _call_setup_app
>     func(command, conf, vars)
>   File
> "/home/jetmind/p/42cc/allura/sourceforge-allura/Allura/allura/websetup/__init__.py",
> line 38, in setup_app
>     bootstrap.bootstrap(command, conf, vars)
>   File
> "/home/jetmind/p/42cc/allura/sourceforge-allura/Allura/allura/websetup/bootstrap.py",
> line 131, in bootstrap
>     p_users = project_reg.register_neighborhood_project(n_users, [root])
>   File
> "/home/jetmind/p/42cc/allura/sourceforge-allura/Allura/allura/lib/plugin.py",
> line 468, in register_neighborhood_project
>     ('admin', 'admin', 'Admin')])
>   File
> "/home/jetmind/p/42cc/allura/sourceforge-allura/Allura/allura/model/project.py",
> line 843, in configure_project
>     self.install_app(ep_name, mount_point, label, ordinal=i)
>   File
> "/home/jetmind/p/42cc/allura/sourceforge-allura/Allura/allura/model/project.py",
> line 650, in install_app
>     app.install(self)
>   File
> "/home/jetmind/p/42cc/allura/sourceforge-allura/ForgeWiki/forgewiki/wiki_main.py",
> line 256, in install
>     super(ForgeWikiApp, self).install(project)
>   File
> "/home/jetmind/p/42cc/allura/sourceforge-allura/Allura/allura/app.py", line
> 464, in install
>     session(discussion).flush()
>   File
> "/home/jetmind/.virtualenvs/allura/local/lib/python2.7/site-packages/ming/odm/base.py",
> line 30, in inner
>     call_hook(obj, after_meth, *args, **kwargs)
>   File
> "/home/jetmind/.virtualenvs/allura/local/lib/python2.7/site-packages/ming/odm/base.py",
> line 16, in call_hook
>     getattr(e, hook_name)(*args, **kw)
>   File
> "/home/jetmind/p/42cc/allura/sourceforge-allura/Allura/allura/model/session.py",
> line 75, in after_flush
>     g.zarkov_event('create', extra=obj.index_id())
>   File
> "/home/jetmind/p/42cc/allura/sourceforge-allura/Allura/allura/lib/app_globals.py",
> line 365, in zarkov_event
>     self._zarkov.event(event_type, context, extra)
>   File
> "/home/jetmind/p/42cc/allura/sourceforge-allura/Allura/allura/lib/zarkov_helpers.py",
> line 38, in event
>     self._sock.send(bson.BSON.encode(obj))
>   File "socket.pyx", line 530, in zmq.core.socket.Socket.send
> (zmq/core/socket.c:4905)
>   File "socket.pyx", line 577, in zmq.core.socket.Socket.send
> (zmq/core/socket.c:4673)
>   File "socket.pyx", line 174, in zmq.core.socket._send_copy
> (zmq/core/socket.c:1915)
>   File "checkrc.pxd", line 11, in zmq.core.checkrc._check_rc
> (zmq/core/socket.c:5511)
>   File
> "/home/jetmind/.virtualenvs/allura/local/lib/python2.7/site-packages/async/__init__.py",
> line 21, in thread_interrupt_handler
>     prev_handler(signum, frame)
> KeyboardInterrupt
> 
> 
> On Tue, Feb 4, 2014 at 8:51 PM, Tim Van Steenburgh <tvansteenburgh@gmail.com
>> wrote:
> 
>> Yeah, that's certainly worth a try. I don't think there's a way to
>> override from the cmd line, but you can experiment with different values
>> for `PROC_TIMEOUT` on line 33 of `run_tests`. If you find a value that
>> consistently works for you feel free to commit that, as I don't think a
>> higher value would hurt anything in the general case.
>>
>>
>> On Tuesday, February 4, 2014 at 12:37 PM, Dave Brondsema wrote:
>>
>>> Would a higher default timeout value in run_tests help?
>>>
>>> On 2/4/14 11:31 AM, Tim Van Steenburgh wrote:
>>>> The ./run_tests scripts now uses the nose multiproc plugin to run
>> tests concurrently where possible. You can disable this and revert to the
>> old behavior by running `./run_tests -m 1`.
>>>>
>>>>
>>>> On Tuesday, February 4, 2014 at 11:19 AM, Igor Bondarenko wrote:
>>>>
>>>>> Hey guys,
>>>>>
>>>>> I and other developers getting test failures by timeout (both on our
>>>>> internal CI and locally). I wonder if it's due to some recent
>> changes?
>>>>> Tests in older branches pass just fine.
>>>>>
>>>>> Dave says it can be related to some changes Tim made. Any ideas?
>>>>>
>>>>> Thanks
>>>>>
>>>>> Example trace here (but there are a lot of them in various apps):
>>>>>
>>>>>
>> ======================================================================
>>>>> ERROR:
>>>>>
>> allura.tests.functional.test_home.TestProjectHome.test_project_group_nav_more_than_ten
>>>>>
>> ----------------------------------------------------------------------
>>>>> Traceback (most recent call last):
>>>>> File
>>>>>
>> "/var/local/env-allura/lib/python2.7/site-packages/nose/plugins/multiprocess.py",
>>>>> line 812, in run
>>>>> test(orig)
>>>>> File
>> "/var/local/env-allura/lib/python2.7/site-packages/nose/case.py",
>>>>> line 45, in __call__
>>>>> return self.run(*arg, **kwarg)
>>>>> File
>> "/var/local/env-allura/lib/python2.7/site-packages/nose/case.py",
>>>>> line 133, in run
>>>>> self.runTest(result)
>>>>> File
>> "/var/local/env-allura/lib/python2.7/site-packages/nose/case.py",
>>>>> line 151, in runTest
>>>>> test(result)
>>>>> File "/usr/lib64/python2.7/unittest/case.py", line 429, in __call__
>>>>> return self.run(*args, **kwds)
>>>>> File "/usr/lib64/python2.7/unittest/case.py", line 356, in run
>>>>> self.setUp()
>>>>> File
>> "/var/local/env-allura/lib/python2.7/site-packages/nose/case.py",
>>>>> line 381, in setUp
>>>>> try_run(self.inst, ('setup', 'setUp'))
>>>>> File
>> "/var/local/env-allura/lib/python2.7/site-packages/nose/util.py",
>>>>> line 469, in try_run
>>>>> return func()
>>>>> File
>>>>>
>> "/home/fortytwo/fortytwo-1034/forge/AlluraTest/alluratest/controller.py",
>>>>> line 129, in setUp
>>>>> setup_functional_test(app_name=self.application_under_test))
>>>>> File
>>>>>
>> "/home/fortytwo/fortytwo-1034/forge/AlluraTest/alluratest/controller.py",
>>>>> line 83, in setup_functional_test
>>>>> setup_basic_test(config, app_name)
>>>>> File
>>>>>
>> "/home/fortytwo/fortytwo-1034/forge/AlluraTest/alluratest/controller.py",
>>>>> line 72, in setup_basic_test
>>>>> cmd.run([test_file])
>>>>> File
>>>>>
>> "/var/local/env-allura/lib/python2.7/site-packages/PasteScript-1.7.4.2-py2.7.egg/paste/script/appinstall.py",
>>>>> line 68, in run
>>>>> return super(AbstractInstallCommand, self).run(new_args)
>>>>> File
>>>>>
>> "/var/local/env-allura/lib/python2.7/site-packages/PasteScript-1.7.4.2-py2.7.egg/paste/script/command.py",
>>>>> line 238, in run
>>>>> result = self.command()
>>>>> File
>>>>>
>> "/var/local/env-allura/lib/python2.7/site-packages/PasteScript-1.7.4.2-py2.7.egg/paste/script/appinstall.py",
>>>>> line 447, in command
>>>>> conf = appconfig(config_spec, relative_to=os.getcwd())
>>>>> File
>>>>>
>> "/var/local/env-allura/lib/python2.7/site-packages/PasteDeploy-1.5.0-py2.7.egg/paste/deploy/loadwsgi.py",
>>>>> line 261, in appconfig
>>>>> global_conf=global_conf)
>>>>> File
>>>>>
>> "/var/local/env-allura/lib/python2.7/site-packages/PasteDeploy-1.5.0-py2.7.egg/paste/deploy/loadwsgi.py",
>>>>> line 296, in loadcontext
>>>>> global_conf=global_conf)
>>>>> File
>>>>>
>> "/var/local/env-allura/lib/python2.7/site-packages/PasteDeploy-1.5.0-py2.7.egg/paste/deploy/loadwsgi.py",
>>>>> line 320, in _loadconfig
>>>>> return loader.get_context(object_type, name, global_conf)
>>>>> File
>>>>>
>> "/var/local/env-allura/lib/python2.7/site-packages/PasteDeploy-1.5.0-py2.7.egg/paste/deploy/loadwsgi.py",
>>>>> line 454, in get_context
>>>>> section)
>>>>> File
>>>>>
>> "/var/local/env-allura/lib/python2.7/site-packages/PasteDeploy-1.5.0-py2.7.egg/paste/deploy/loadwsgi.py",
>>>>> line 476, in _context_from_use
>>>>> object_type, name=use, global_conf=global_conf)
>>>>> File
>>>>>
>> "/var/local/env-allura/lib/python2.7/site-packages/PasteDeploy-1.5.0-py2.7.egg/paste/deploy/loadwsgi.py",
>>>>> line 406, in get_context
>>>>> global_conf=global_conf)
>>>>> File
>>>>>
>> "/var/local/env-allura/lib/python2.7/site-packages/PasteDeploy-1.5.0-py2.7.egg/paste/deploy/loadwsgi.py",
>>>>> line 296, in loadcontext
>>>>> global_conf=global_conf)
>>>>> File
>>>>>
>> "/var/local/env-allura/lib/python2.7/site-packages/PasteDeploy-1.5.0-py2.7.egg/paste/deploy/loadwsgi.py",
>>>>> line 320, in _loadconfig
>>>>> return loader.get_context(object_type, name, global_conf)
>>>>> File
>>>>>
>> "/var/local/env-allura/lib/python2.7/site-packages/PasteDeploy-1.5.0-py2.7.egg/paste/deploy/loadwsgi.py",
>>>>> line 454, in get_context
>>>>> section)
>>>>> File
>>>>>
>> "/var/local/env-allura/lib/python2.7/site-packages/PasteDeploy-1.5.0-py2.7.egg/paste/deploy/loadwsgi.py",
>>>>> line 476, in _context_from_use
>>>>> object_type, name=use, global_conf=global_conf)
>>>>> File
>>>>>
>> "/var/local/env-allura/lib/python2.7/site-packages/PasteDeploy-1.5.0-py2.7.egg/paste/deploy/loadwsgi.py",
>>>>> line 406, in get_context
>>>>> global_conf=global_conf)
>>>>> File
>>>>>
>> "/var/local/env-allura/lib/python2.7/site-packages/PasteDeploy-1.5.0-py2.7.egg/paste/deploy/loadwsgi.py",
>>>>> line 296, in loadcontext
>>>>> global_conf=global_conf)
>>>>> File
>>>>>
>> "/var/local/env-allura/lib/python2.7/site-packages/PasteDeploy-1.5.0-py2.7.egg/paste/deploy/loadwsgi.py",
>>>>> line 328, in _loadegg
>>>>> return loader.get_context(object_type, name, global_conf)
>>>>> File
>>>>>
>> "/var/local/env-allura/lib/python2.7/site-packages/PasteDeploy-1.5.0-py2.7.egg/paste/deploy/loadwsgi.py",
>>>>> line 620, in get_context
>>>>> object_type, name=name)
>>>>> File
>>>>>
>> "/var/local/env-allura/lib/python2.7/site-packages/PasteDeploy-1.5.0-py2.7.egg/paste/deploy/loadwsgi.py",
>>>>> line 640, in find_egg_entry_point
>>>>> pkg_resources.require(self.spec)
>>>>> File
>>>>>
>> "/var/local/env-allura/lib/python2.7/site-packages/setuptools-0.6c11-py2.7.egg/pkg_resources.py",
>>>>> line 669, in require
>>>>> self.add(dist)
>>>>> File
>>>>>
>> "/var/local/env-allura/lib/python2.7/site-packages/setuptools-0.6c11-py2.7.egg/pkg_resources.py",
>>>>> line 518, in add
>>>>> dist.insert_on(self.entries, entry)
>>>>> File
>>>>>
>> "/var/local/env-allura/lib/python2.7/site-packages/nose/plugins/multiprocess.py",
>>>>> line 276, in signalhandler
>>>>> raise TimedOutException()
>>>>> TimedOutException:
>>>>>
>> 'allura.tests.functional.test_home.TestProjectHome.test_project_group_nav_more_than_ten'
>>>>>
>>>>
>>>>
>>>
>>>
>>>
>>>
>>> --
>>> Dave Brondsema : dave@brondsema.net (mailto:dave@brondsema.net)
>>> http://www.brondsema.net : personal
>>> http://www.splike.com : programming
>>> <><
>>>
>>>
>>
>>
>>
> 



-- 
Dave Brondsema : dave@brondsema.net
http://www.brondsema.net : personal
http://www.splike.com : programming
              <><

Mime
View raw message