incubator-allura-dev mailing list archives

Site index · List index
Message view « Date » · « Thread »
Top « Date » · « Thread »
From Apache Jenkins Server <jenk...@builds.apache.org>
Subject Build failed in Jenkins: Allura #84
Date Fri, 28 Jun 2013 22:20:54 GMT
See <https://builds.apache.org/job/Allura/84/changes>

Changes:

[cjohns] [#6364] Set SVN checkout_url on clone

[cjohns] [#6364] Fixed tests when run in isolation and improved docstring

------------------------------------------
[...truncated 1800 lines...]
  File "/home/hudson/jenkins-slave/workspace/Allura/.allura-venv/local/lib/python2.7/site-packages/nose/case.py",
line 381, in setUp
    try_run(self.inst, ('setup', 'setUp'))
  File "/home/hudson/jenkins-slave/workspace/Allura/.allura-venv/local/lib/python2.7/site-packages/nose/util.py",
line 478, in try_run
    return func()
  File "/home/hudson/jenkins-slave/workspace/Allura/ForgeSVN/forgesvn/tests/functional/test_controllers.py",
line 39, in setUp
    self.setup_with_tools()
  File "/home/hudson/jenkins-slave/workspace/Allura/Allura/allura/tests/decorators.py", line
63, in wrapped
    c.app = p.install_app(ep_name, mount_point, mount_label, ordinal, **override_options)
  File "/home/hudson/jenkins-slave/workspace/Allura/Allura/allura/model/project.py", line
573, in install_app
    App = g.entry_points['tool'][ep_name]
  File "/home/hudson/jenkins-slave/workspace/Allura/Allura/allura/lib/utils.py", line 389,
in __getitem__
    return self.store[self.__keytransform__(key)]
KeyError: u"'svn'\n-------------------- >> begin captured stdout << ---------------------\nRunning
setup_app() from allura.websetup\n\n--------------------- >> end captured stdout <<
----------------------"

======================================================================
ERROR: forgesvn.tests.functional.test_controllers.TestRootController.test_status
----------------------------------------------------------------------
Traceback (most recent call last):
  File "/home/hudson/jenkins-slave/workspace/Allura/.allura-venv/local/lib/python2.7/site-packages/nose/case.py",
line 381, in setUp
    try_run(self.inst, ('setup', 'setUp'))
  File "/home/hudson/jenkins-slave/workspace/Allura/.allura-venv/local/lib/python2.7/site-packages/nose/util.py",
line 478, in try_run
    return func()
  File "/home/hudson/jenkins-slave/workspace/Allura/ForgeSVN/forgesvn/tests/functional/test_controllers.py",
line 39, in setUp
    self.setup_with_tools()
  File "/home/hudson/jenkins-slave/workspace/Allura/Allura/allura/tests/decorators.py", line
63, in wrapped
    c.app = p.install_app(ep_name, mount_point, mount_label, ordinal, **override_options)
  File "/home/hudson/jenkins-slave/workspace/Allura/Allura/allura/model/project.py", line
573, in install_app
    App = g.entry_points['tool'][ep_name]
  File "/home/hudson/jenkins-slave/workspace/Allura/Allura/allura/lib/utils.py", line 389,
in __getitem__
    return self.store[self.__keytransform__(key)]
KeyError: u"'svn'\n-------------------- >> begin captured stdout << ---------------------\nRunning
setup_app() from allura.websetup\n\n--------------------- >> end captured stdout <<
----------------------"

======================================================================
ERROR: forgesvn.tests.functional.test_controllers.TestRootController.test_status_html
----------------------------------------------------------------------
Traceback (most recent call last):
  File "/home/hudson/jenkins-slave/workspace/Allura/.allura-venv/local/lib/python2.7/site-packages/nose/case.py",
line 381, in setUp
    try_run(self.inst, ('setup', 'setUp'))
  File "/home/hudson/jenkins-slave/workspace/Allura/.allura-venv/local/lib/python2.7/site-packages/nose/util.py",
line 478, in try_run
    return func()
  File "/home/hudson/jenkins-slave/workspace/Allura/ForgeSVN/forgesvn/tests/functional/test_controllers.py",
line 39, in setUp
    self.setup_with_tools()
  File "/home/hudson/jenkins-slave/workspace/Allura/Allura/allura/tests/decorators.py", line
63, in wrapped
    c.app = p.install_app(ep_name, mount_point, mount_label, ordinal, **override_options)
  File "/home/hudson/jenkins-slave/workspace/Allura/Allura/allura/model/project.py", line
573, in install_app
    App = g.entry_points['tool'][ep_name]
  File "/home/hudson/jenkins-slave/workspace/Allura/Allura/allura/lib/utils.py", line 389,
in __getitem__
    return self.store[self.__keytransform__(key)]
KeyError: u"'svn'\n-------------------- >> begin captured stdout << ---------------------\nRunning
setup_app() from allura.websetup\n\n--------------------- >> end captured stdout <<
----------------------"

======================================================================
ERROR: forgesvn.tests.functional.test_controllers.TestRootController.test_tarball
----------------------------------------------------------------------
Traceback (most recent call last):
  File "/home/hudson/jenkins-slave/workspace/Allura/.allura-venv/local/lib/python2.7/site-packages/nose/case.py",
line 381, in setUp
    try_run(self.inst, ('setup', 'setUp'))
  File "/home/hudson/jenkins-slave/workspace/Allura/.allura-venv/local/lib/python2.7/site-packages/nose/util.py",
line 478, in try_run
    return func()
  File "/home/hudson/jenkins-slave/workspace/Allura/ForgeSVN/forgesvn/tests/functional/test_controllers.py",
line 39, in setUp
    self.setup_with_tools()
  File "/home/hudson/jenkins-slave/workspace/Allura/Allura/allura/tests/decorators.py", line
63, in wrapped
    c.app = p.install_app(ep_name, mount_point, mount_label, ordinal, **override_options)
  File "/home/hudson/jenkins-slave/workspace/Allura/Allura/allura/model/project.py", line
573, in install_app
    App = g.entry_points['tool'][ep_name]
  File "/home/hudson/jenkins-slave/workspace/Allura/Allura/allura/lib/utils.py", line 389,
in __getitem__
    return self.store[self.__keytransform__(key)]
KeyError: u"'svn'\n-------------------- >> begin captured stdout << ---------------------\nRunning
setup_app() from allura.websetup\n\n--------------------- >> end captured stdout <<
----------------------"

======================================================================
ERROR: forgesvn.tests.functional.test_controllers.TestRootController.test_tarball_tags_aware
----------------------------------------------------------------------
Traceback (most recent call last):
  File "/home/hudson/jenkins-slave/workspace/Allura/.allura-venv/local/lib/python2.7/site-packages/nose/case.py",
line 381, in setUp
    try_run(self.inst, ('setup', 'setUp'))
  File "/home/hudson/jenkins-slave/workspace/Allura/.allura-venv/local/lib/python2.7/site-packages/nose/util.py",
line 478, in try_run
    return func()
  File "/home/hudson/jenkins-slave/workspace/Allura/ForgeSVN/forgesvn/tests/functional/test_controllers.py",
line 39, in setUp
    self.setup_with_tools()
  File "/home/hudson/jenkins-slave/workspace/Allura/Allura/allura/tests/decorators.py", line
63, in wrapped
    c.app = p.install_app(ep_name, mount_point, mount_label, ordinal, **override_options)
  File "/home/hudson/jenkins-slave/workspace/Allura/Allura/allura/model/project.py", line
573, in install_app
    App = g.entry_points['tool'][ep_name]
  File "/home/hudson/jenkins-slave/workspace/Allura/Allura/allura/lib/utils.py", line 389,
in __getitem__
    return self.store[self.__keytransform__(key)]
KeyError: u"'svn'\n-------------------- >> begin captured stdout << ---------------------\nRunning
setup_app() from allura.websetup\n\n--------------------- >> end captured stdout <<
----------------------"

======================================================================
ERROR: forgesvn.tests.functional.test_controllers.TestRootController.test_tree
----------------------------------------------------------------------
Traceback (most recent call last):
  File "/home/hudson/jenkins-slave/workspace/Allura/.allura-venv/local/lib/python2.7/site-packages/nose/case.py",
line 381, in setUp
    try_run(self.inst, ('setup', 'setUp'))
  File "/home/hudson/jenkins-slave/workspace/Allura/.allura-venv/local/lib/python2.7/site-packages/nose/util.py",
line 478, in try_run
    return func()
  File "/home/hudson/jenkins-slave/workspace/Allura/ForgeSVN/forgesvn/tests/functional/test_controllers.py",
line 39, in setUp
    self.setup_with_tools()
  File "/home/hudson/jenkins-slave/workspace/Allura/Allura/allura/tests/decorators.py", line
63, in wrapped
    c.app = p.install_app(ep_name, mount_point, mount_label, ordinal, **override_options)
  File "/home/hudson/jenkins-slave/workspace/Allura/Allura/allura/model/project.py", line
573, in install_app
    App = g.entry_points['tool'][ep_name]
  File "/home/hudson/jenkins-slave/workspace/Allura/Allura/allura/lib/utils.py", line 389,
in __getitem__
    return self.store[self.__keytransform__(key)]
KeyError: u"'svn'\n-------------------- >> begin captured stdout << ---------------------\nRunning
setup_app() from allura.websetup\n\n--------------------- >> end captured stdout <<
----------------------"

======================================================================
ERROR: Failure: ImportError (No module named pysvn)
----------------------------------------------------------------------
Traceback (most recent call last):
  File "/home/hudson/jenkins-slave/workspace/Allura/.allura-venv/local/lib/python2.7/site-packages/nose/loader.py",
line 390, in loadTestsFromName
    addr.filename, addr.module)
  File "/home/hudson/jenkins-slave/workspace/Allura/.allura-venv/local/lib/python2.7/site-packages/nose/importer.py",
line 39, in importFromPath
    return self.importFromDir(dir_path, fqname)
  File "/home/hudson/jenkins-slave/workspace/Allura/.allura-venv/local/lib/python2.7/site-packages/nose/importer.py",
line 86, in importFromDir
    mod = load_module(part_fqname, fh, filename, desc)
  File "/home/hudson/jenkins-slave/workspace/Allura/ForgeSVN/forgesvn/tests/model/test_repository.py",
line 36, in <module>
    import pysvn
ImportError: No module named pysvn

======================================================================
ERROR: Failure: ImportError (No module named pysvn)
----------------------------------------------------------------------
Traceback (most recent call last):
  File "/home/hudson/jenkins-slave/workspace/Allura/.allura-venv/local/lib/python2.7/site-packages/nose/loader.py",
line 390, in loadTestsFromName
    addr.filename, addr.module)
  File "/home/hudson/jenkins-slave/workspace/Allura/.allura-venv/local/lib/python2.7/site-packages/nose/importer.py",
line 39, in importFromPath
    return self.importFromDir(dir_path, fqname)
  File "/home/hudson/jenkins-slave/workspace/Allura/.allura-venv/local/lib/python2.7/site-packages/nose/importer.py",
line 86, in importFromDir
    mod = load_module(part_fqname, fh, filename, desc)
  File "/home/hudson/jenkins-slave/workspace/Allura/ForgeSVN/forgesvn/tests/model/test_svnimplementation.py",
line 24, in <module>
    from forgesvn.model.svn import SVNImplementation
  File "/home/hudson/jenkins-slave/workspace/Allura/ForgeSVN/forgesvn/model/__init__.py",
line 18, in <module>
    from svn import Repository
  File "/home/hudson/jenkins-slave/workspace/Allura/ForgeSVN/forgesvn/model/svn.py", line
33, in <module>
    import pysvn
ImportError: No module named pysvn

======================================================================
ERROR: test_admin_menu (forgesvn.tests.test_svn_app.TestSVNApp)
----------------------------------------------------------------------
Traceback (most recent call last):
  File "/home/hudson/jenkins-slave/workspace/Allura/ForgeSVN/forgesvn/tests/test_svn_app.py",
line 32, in setUp
    self.setup_with_tools()
  File "/home/hudson/jenkins-slave/workspace/Allura/Allura/allura/tests/decorators.py", line
63, in wrapped
    c.app = p.install_app(ep_name, mount_point, mount_label, ordinal, **override_options)
  File "/home/hudson/jenkins-slave/workspace/Allura/Allura/allura/model/project.py", line
573, in install_app
    App = g.entry_points['tool'][ep_name]
  File "/home/hudson/jenkins-slave/workspace/Allura/Allura/allura/lib/utils.py", line 389,
in __getitem__
    return self.store[self.__keytransform__(key)]
KeyError: u"'svn'\n-------------------- >> begin captured stdout << ---------------------\nRunning
setup_app() from allura.websetup\n\n--------------------- >> end captured stdout <<
----------------------"

======================================================================
ERROR: test_uninstall (forgesvn.tests.test_svn_app.TestSVNApp)
----------------------------------------------------------------------
Traceback (most recent call last):
  File "/home/hudson/jenkins-slave/workspace/Allura/ForgeSVN/forgesvn/tests/test_svn_app.py",
line 32, in setUp
    self.setup_with_tools()
  File "/home/hudson/jenkins-slave/workspace/Allura/Allura/allura/tests/decorators.py", line
63, in wrapped
    c.app = p.install_app(ep_name, mount_point, mount_label, ordinal, **override_options)
  File "/home/hudson/jenkins-slave/workspace/Allura/Allura/allura/model/project.py", line
573, in install_app
    App = g.entry_points['tool'][ep_name]
  File "/home/hudson/jenkins-slave/workspace/Allura/Allura/allura/lib/utils.py", line 389,
in __getitem__
    return self.store[self.__keytransform__(key)]
KeyError: u"'svn'\n-------------------- >> begin captured stdout << ---------------------\nRunning
setup_app() from allura.websetup\n\n--------------------- >> end captured stdout <<
----------------------"

======================================================================
ERROR: test_clone (forgesvn.tests.test_tasks.TestRepoTasks)
----------------------------------------------------------------------
Traceback (most recent call last):
  File "/home/hudson/jenkins-slave/workspace/Allura/ForgeSVN/forgesvn/tests/test_tasks.py",
line 42, in setUp
    self.setup_with_tools()
  File "/home/hudson/jenkins-slave/workspace/Allura/Allura/allura/tests/decorators.py", line
63, in wrapped
    c.app = p.install_app(ep_name, mount_point, mount_label, ordinal, **override_options)
  File "/home/hudson/jenkins-slave/workspace/Allura/Allura/allura/model/project.py", line
573, in install_app
    App = g.entry_points['tool'][ep_name]
  File "/home/hudson/jenkins-slave/workspace/Allura/Allura/allura/lib/utils.py", line 389,
in __getitem__
    return self.store[self.__keytransform__(key)]
KeyError: u"'svn'\n-------------------- >> begin captured stdout << ---------------------\nRunning
setup_app() from allura.websetup\n\n--------------------- >> end captured stdout <<
----------------------"

======================================================================
ERROR: test_init (forgesvn.tests.test_tasks.TestRepoTasks)
----------------------------------------------------------------------
Traceback (most recent call last):
  File "/home/hudson/jenkins-slave/workspace/Allura/ForgeSVN/forgesvn/tests/test_tasks.py",
line 42, in setUp
    self.setup_with_tools()
  File "/home/hudson/jenkins-slave/workspace/Allura/Allura/allura/tests/decorators.py", line
63, in wrapped
    c.app = p.install_app(ep_name, mount_point, mount_label, ordinal, **override_options)
  File "/home/hudson/jenkins-slave/workspace/Allura/Allura/allura/model/project.py", line
573, in install_app
    App = g.entry_points['tool'][ep_name]
  File "/home/hudson/jenkins-slave/workspace/Allura/Allura/allura/lib/utils.py", line 389,
in __getitem__
    return self.store[self.__keytransform__(key)]
KeyError: u"'svn'\n-------------------- >> begin captured stdout << ---------------------\nRunning
setup_app() from allura.websetup\n\n--------------------- >> end captured stdout <<
----------------------"

======================================================================
ERROR: test_refresh (forgesvn.tests.test_tasks.TestRepoTasks)
----------------------------------------------------------------------
Traceback (most recent call last):
  File "/home/hudson/jenkins-slave/workspace/Allura/ForgeSVN/forgesvn/tests/test_tasks.py",
line 42, in setUp
    self.setup_with_tools()
  File "/home/hudson/jenkins-slave/workspace/Allura/Allura/allura/tests/decorators.py", line
63, in wrapped
    c.app = p.install_app(ep_name, mount_point, mount_label, ordinal, **override_options)
  File "/home/hudson/jenkins-slave/workspace/Allura/Allura/allura/model/project.py", line
573, in install_app
    App = g.entry_points['tool'][ep_name]
  File "/home/hudson/jenkins-slave/workspace/Allura/Allura/allura/lib/utils.py", line 389,
in __getitem__
    return self.store[self.__keytransform__(key)]
KeyError: u"'svn'\n-------------------- >> begin captured stdout << ---------------------\nRunning
setup_app() from allura.websetup\n\n--------------------- >> end captured stdout <<
----------------------"

======================================================================
ERROR: test_uninstall (forgesvn.tests.test_tasks.TestRepoTasks)
----------------------------------------------------------------------
Traceback (most recent call last):
  File "/home/hudson/jenkins-slave/workspace/Allura/ForgeSVN/forgesvn/tests/test_tasks.py",
line 42, in setUp
    self.setup_with_tools()
  File "/home/hudson/jenkins-slave/workspace/Allura/Allura/allura/tests/decorators.py", line
63, in wrapped
    c.app = p.install_app(ep_name, mount_point, mount_label, ordinal, **override_options)
  File "/home/hudson/jenkins-slave/workspace/Allura/Allura/allura/model/project.py", line
573, in install_app
    App = g.entry_points['tool'][ep_name]
  File "/home/hudson/jenkins-slave/workspace/Allura/Allura/allura/lib/utils.py", line 389,
in __getitem__
    return self.store[self.__keytransform__(key)]
KeyError: u"'svn'\n-------------------- >> begin captured stdout << ---------------------\nRunning
setup_app() from allura.websetup\n\n--------------------- >> end captured stdout <<
----------------------"

Name                 Stmts   Miss  Cover   Missing
--------------------------------------------------
forgesvn                 0      0   100%   
forgesvn.templates       0      0   100%   
--------------------------------------------------
TOTAL                    0      0   100%   
----------------------------------------------------------------------
Ran 31 tests in 26.267s

FAILED (errors=31)
/home/hudson/jenkins-slave/workspace/Allura/ForgeDiscussion /home/hudson/jenkins-slave/workspace/Allura
/home/hudson/jenkins-slave/workspace/Allura
/home/hudson/jenkins-slave/workspace/Allura/ForgeBlog /home/hudson/jenkins-slave/workspace/Allura
/home/hudson/jenkins-slave/workspace/Allura
/home/hudson/jenkins-slave/workspace/Allura/Allura /home/hudson/jenkins-slave/workspace/Allura
/home/hudson/jenkins-slave/workspace/Allura
/home/hudson/jenkins-slave/workspace/Allura/ForgeChat /home/hudson/jenkins-slave/workspace/Allura
/home/hudson/jenkins-slave/workspace/Allura
/home/hudson/jenkins-slave/workspace/Allura/ForgeSVN /home/hudson/jenkins-slave/workspace/Allura
/home/hudson/jenkins-slave/workspace/Allura
/home/hudson/jenkins-slave/workspace/Allura/AlluraTesting /home/hudson/jenkins-slave/workspace/Allura
/home/hudson/jenkins-slave/workspace/Allura
/home/hudson/jenkins-slave/workspace/Allura/ForgeGit /home/hudson/jenkins-slave/workspace/Allura
/home/hudson/jenkins-slave/workspace/Allura
/home/hudson/jenkins-slave/workspace/Allura/ForgeLink /home/hudson/jenkins-slave/workspace/Allura
/home/hudson/jenkins-slave/workspace/Allura
Build step 'Execute shell' marked build as failure
Skipping Cobertura coverage report as build was not SUCCESS or better ...
Recording test results

Mime
View raw message