incubator-airavata-dev mailing list archives

Site index · List index
Message view « Date » · « Thread »
Top « Date » · « Thread »
From Apache Jenkins Server <jenk...@builds.apache.org>
Subject Build failed in Jenkins: Airavata #216
Date Wed, 09 Nov 2011 20:23:27 GMT
See <https://builds.apache.org/job/Airavata/216/changes>

Changes:

[smarru] Updating license files to seperate source and binary notices to address AIRAVATA-186

[smarru] Updating license files to seperate source and binary notices to address AIRAVATA-186

[smarru] adding license and notice files specific to binaries.

------------------------------------------
[...truncated 2255 lines...]
[INFO] --- maven-clean-plugin:2.4.1:clean (default-clean) @ messenger-client ---
[INFO] [INFO] Using 'UTF-8' encoding to copy filtered resources.
[INFO] skip non existing resourceDirectory <https://builds.apache.org/job/Airavata/ws/modules/ws-messenger/client/src/main/resources>

[INFO] --- maven-resources-plugin:2.4.3:resources (default-resources) @ messenger-client ---
[INFO] [INFO] Compiling 33 source files to <https://builds.apache.org/job/Airavata/ws/modules/ws-messenger/client/target/classes>

[INFO] --- maven-compiler-plugin:2.0.2:compile (default-compile) @ messenger-client ---
[INFO] Using 'UTF-8' encoding to copy filtered resources.
[INFO] [INFO] skip non existing resourceDirectory <https://builds.apache.org/job/Airavata/ws/modules/ws-messenger/client/src/test/resources>

[INFO] --- maven-resources-plugin:2.4.3:testResources (default-testResources) @ messenger-client
---
[INFO] [INFO] Compiling 4 source files to <https://builds.apache.org/job/Airavata/ws/modules/ws-messenger/client/target/test-classes>

[INFO] --- maven-compiler-plugin:2.0.2:testCompile (default-testCompile) @ messenger-client
---
[INFO] [INFO] Tests are skipped.

[INFO] --- maven-surefire-plugin:2.10:test (default-test) @ messenger-client ---
[JENKINS] Recording test results
[INFO] 
[INFO] --- maven-jar-plugin:2.3.1:jar (default-jar) @ messenger-client ---
[INFO] Building jar: <https://builds.apache.org/job/Airavata/ws/modules/ws-messenger/client/target/messenger-client-0.1-incubating-SNAPSHOT.jar>
[INFO] [INFO] Installing <https://builds.apache.org/job/Airavata/ws/modules/ws-messenger/client/target/messenger-client-0.1-incubating-SNAPSHOT.jar>
to /home/jenkins/.m2/repository/org/apache/airavata/messenger-client/0.1-incubating-SNAPSHOT/messenger-client-0.1-incubating-SNAPSHOT.jar
[INFO] Installing <https://builds.apache.org/job/Airavata/ws/modules/ws-messenger/client/pom.xml>
to /home/jenkins/.m2/repository/org/apache/airavata/messenger-client/0.1-incubating-SNAPSHOT/messenger-client-0.1-incubating-SNAPSHOT.pom

[INFO] --- maven-install-plugin:2.3.1:install (default-install) @ messenger-client ---
[JENKINS] Archiving <https://builds.apache.org/job/Airavata/ws/modules/ws-messenger/client/pom.xml>
to /home/hudson/hudson/jobs/Airavata/modules/org.apache.airavata$messenger-client/builds/2011-11-09_20-21-36/archive/org.apache.airavata/messenger-client/0.1-incubating-SNAPSHOT/messenger-client-0.1-incubating-SNAPSHOT.pom
[JENKINS] Archiving <https://builds.apache.org/job/Airavata/ws/modules/ws-messenger/client/target/messenger-client-0.1-incubating-SNAPSHOT.jar>
to /home/hudson/hudson/jobs/Airavata/modules/org.apache.airavata$messenger-client/builds/2011-11-09_20-21-36/archive/org.apache.airavata/messenger-client/0.1-incubating-SNAPSHOT/messenger-client-0.1-incubating-SNAPSHOT.jar
[INFO]                                                                         
[INFO] ------------------------------------------------------------------------
[INFO] Building Airavata Workflow Tracking 0.1-incubating-SNAPSHOT
[INFO] ------------------------------------------------------------------------
[INFO] 
[INFO] --- maven-clean-plugin:2.4.1:clean (default-clean) @ workflowtracking ---
[INFO] 
[INFO] --- build-helper-maven-plugin:1.5:add-source (add-source) @ workflowtracking ---
[INFO] Source directory: <https://builds.apache.org/job/Airavata/ws/modules/commons/workflow-tracking/target/generated-sources/xmlbeans>
added.
[INFO] 
[INFO] --- xmlbeans-maven-plugin:2.3.3:xmlbeans (generateBindings) @ workflowtracking ---
[INFO] 
[INFO] --- maven-remote-resources-plugin:1.2.1:process (default) @ workflowtracking ---
[debug] execute contextualize
[INFO] [INFO] Using 'UTF-8' encoding to copy filtered resources.
[INFO] Copying 2 resources

[INFO] --- maven-resources-plugin:2.5:resources (default-resources) @ workflowtracking ---
[INFO] Copying 468 resources
[INFO] Copying 3 resources
[INFO] 
[INFO] --- maven-compiler-plugin:2.0.2:compile (default-compile) @ workflowtracking ---
[INFO] Compiling 59 source files to <https://builds.apache.org/job/Airavata/ws/modules/commons/workflow-tracking/target/classes>
[debug] execute contextualize
[INFO] [INFO] Using 'UTF-8' encoding to copy filtered resources.
[INFO] Copying 0 resource
[INFO] Copying 3 resources

[INFO] --- maven-resources-plugin:2.5:testResources (default-testResources) @ workflowtracking
---
[INFO] [INFO] Nothing to compile - all classes are up to date

[INFO] --- maven-compiler-plugin:2.0.2:testCompile (default-testCompile) @ workflowtracking
---
[INFO] [INFO] Surefire report directory: <https://builds.apache.org/job/Airavata/ws/modules/commons/workflow-tracking/target/surefire-reports>

-------------------------------------------------------
 T E S T S
-------------------------------------------------------

[INFO] --- maven-surefire-plugin:2.10:test (default-test) @ workflowtracking ---

Results :

Tests run: 0, Failures: 0, Errors: 0, Skipped: 0

[JENKINS] Recording test results
[INFO] 
[INFO] --- maven-jar-plugin:2.3.1:jar (default-jar) @ workflowtracking ---
[INFO] Building jar: <https://builds.apache.org/job/Airavata/ws/modules/commons/workflow-tracking/target/workflowtracking-0.1-incubating-SNAPSHOT.jar>
[INFO] 
[INFO] --- maven-site-plugin:3.0:attach-descriptor (attach-descriptor) @ workflowtracking
---
[INFO] [INFO] Installing <https://builds.apache.org/job/Airavata/ws/modules/commons/workflow-tracking/target/workflowtracking-0.1-incubating-SNAPSHOT.jar>
to /home/jenkins/.m2/repository/org/apache/airavata/workflowtracking/0.1-incubating-SNAPSHOT/workflowtracking-0.1-incubating-SNAPSHOT.jar
[INFO] Installing <https://builds.apache.org/job/Airavata/ws/modules/commons/workflow-tracking/pom.xml>
to /home/jenkins/.m2/repository/org/apache/airavata/workflowtracking/0.1-incubating-SNAPSHOT/workflowtracking-0.1-incubating-SNAPSHOT.pom

[INFO] --- maven-install-plugin:2.3.1:install (default-install) @ workflowtracking ---
[JENKINS] Archiving <https://builds.apache.org/job/Airavata/ws/modules/commons/workflow-tracking/pom.xml>
to /home/hudson/hudson/jobs/Airavata/modules/org.apache.airavata$workflowtracking/builds/2011-11-09_20-21-36/archive/org.apache.airavata/workflowtracking/0.1-incubating-SNAPSHOT/workflowtracking-0.1-incubating-SNAPSHOT.pom
[JENKINS] Archiving <https://builds.apache.org/job/Airavata/ws/modules/commons/workflow-tracking/target/workflowtracking-0.1-incubating-SNAPSHOT.jar>
to /home/hudson/hudson/jobs/Airavata/modules/org.apache.airavata$workflowtracking/builds/2011-11-09_20-21-36/archive/org.apache.airavata/workflowtracking/0.1-incubating-SNAPSHOT/workflowtracking-0.1-incubating-SNAPSHOT.jar
[INFO]                                                                         
[INFO] ------------------------------------------------------------------------
[INFO] Building GFac-Core 0.1-incubating-SNAPSHOT
[INFO] ------------------------------------------------------------------------
Downloading: http://community.ucs.indiana.edu:9090/archiva/repository/ogce.m2.all/cog-4_1_6_rc2/puretls/cog-4_1_6/puretls-cog-4_1_6.pom
Downloading: http://people.apache.org/repo/m2-snapshot-repository/cog-4_1_6_rc2/puretls/cog-4_1_6/puretls-cog-4_1_6.pom
Downloading: http://mirrors.ibiblio.org/pub/mirrors/maven2/cog-4_1_6_rc2/puretls/cog-4_1_6/puretls-cog-4_1_6.pom
Downloading: http://download.java.net/maven/2/cog-4_1_6_rc2/puretls/cog-4_1_6/puretls-cog-4_1_6.pom
Downloading: http://people.apache.org/~lahiru/maven-repo/cog-4_1_6_rc2/puretls/cog-4_1_6/puretls-cog-4_1_6.pom
Downloading: http://maven.ow2.org/maven2/cog-4_1_6_rc2/puretls/cog-4_1_6/puretls-cog-4_1_6.pom
Downloading: http://repo1.maven.org/maven2/cog-4_1_6_rc2/puretls/cog-4_1_6/puretls-cog-4_1_6.pom
[WARNING] The POM for cog-4_1_6_rc2:puretls:jar:cog-4_1_6 is missing, no dependency information
available
Downloading: http://community.ucs.indiana.edu:9090/archiva/repository/ogce.m2.all/cog-4_1_6_rc2/cryptix32/cog-4_1_6/cryptix32-cog-4_1_6.pom
Downloading: http://people.apache.org/repo/m2-snapshot-repository/cog-4_1_6_rc2/cryptix32/cog-4_1_6/cryptix32-cog-4_1_6.pom
Downloading: http://mirrors.ibiblio.org/pub/mirrors/maven2/cog-4_1_6_rc2/cryptix32/cog-4_1_6/cryptix32-cog-4_1_6.pom
Downloading: http://download.java.net/maven/2/cog-4_1_6_rc2/cryptix32/cog-4_1_6/cryptix32-cog-4_1_6.pom
Downloading: http://people.apache.org/~lahiru/maven-repo/cog-4_1_6_rc2/cryptix32/cog-4_1_6/cryptix32-cog-4_1_6.pom
Downloading: http://maven.ow2.org/maven2/cog-4_1_6_rc2/cryptix32/cog-4_1_6/cryptix32-cog-4_1_6.pom
Downloading: http://repo1.maven.org/maven2/cog-4_1_6_rc2/cryptix32/cog-4_1_6/cryptix32-cog-4_1_6.pom
[WARNING] The POM for cog-4_1_6_rc2:cryptix32:jar:cog-4_1_6 is missing, no dependency information
available
Downloading: http://community.ucs.indiana.edu:9090/archiva/repository/ogce.m2.all/cog-4_1_6_rc2/cryptix-asn1/cog-4_1_6/cryptix-asn1-cog-4_1_6.pom
Downloading: http://people.apache.org/repo/m2-snapshot-repository/cog-4_1_6_rc2/cryptix-asn1/cog-4_1_6/cryptix-asn1-cog-4_1_6.pom
Downloading: http://mirrors.ibiblio.org/pub/mirrors/maven2/cog-4_1_6_rc2/cryptix-asn1/cog-4_1_6/cryptix-asn1-cog-4_1_6.pom
Downloading: http://download.java.net/maven/2/cog-4_1_6_rc2/cryptix-asn1/cog-4_1_6/cryptix-asn1-cog-4_1_6.pom
Downloading: http://people.apache.org/~lahiru/maven-repo/cog-4_1_6_rc2/cryptix-asn1/cog-4_1_6/cryptix-asn1-cog-4_1_6.pom
Downloading: http://maven.ow2.org/maven2/cog-4_1_6_rc2/cryptix-asn1/cog-4_1_6/cryptix-asn1-cog-4_1_6.pom
Downloading: http://repo1.maven.org/maven2/cog-4_1_6_rc2/cryptix-asn1/cog-4_1_6/cryptix-asn1-cog-4_1_6.pom
[WARNING] The POM for cog-4_1_6_rc2:cryptix-asn1:jar:cog-4_1_6 is missing, no dependency information
available
[INFO] 
[INFO] --- maven-clean-plugin:2.4.1:clean (default-clean) @ gfac-core ---
[INFO] Downloading: http://community.ucs.indiana.edu:9090/archiva/repository/ogce.m2.all/cog-4_1_6_rc2/puretls/cog-4_1_6/puretls-cog-4_1_6.pom

[INFO] --- maven-remote-resources-plugin:1.2.1:process (default) @ gfac-core ---
Downloading: http://people.apache.org/repo/m2-snapshot-repository/cog-4_1_6_rc2/puretls/cog-4_1_6/puretls-cog-4_1_6.pom
Downloading: http://mirrors.ibiblio.org/pub/mirrors/maven2/cog-4_1_6_rc2/puretls/cog-4_1_6/puretls-cog-4_1_6.pom
Downloading: http://download.java.net/maven/2/cog-4_1_6_rc2/puretls/cog-4_1_6/puretls-cog-4_1_6.pom
Downloading: http://people.apache.org/~lahiru/maven-repo/cog-4_1_6_rc2/puretls/cog-4_1_6/puretls-cog-4_1_6.pom
Downloading: http://maven.ow2.org/maven2/cog-4_1_6_rc2/puretls/cog-4_1_6/puretls-cog-4_1_6.pom
Downloading: http://repo1.maven.org/maven2/cog-4_1_6_rc2/puretls/cog-4_1_6/puretls-cog-4_1_6.pom
[WARNING] Missing POM for cog-4_1_6_rc2:puretls:jar:cog-4_1_6
Downloading: http://community.ucs.indiana.edu:9090/archiva/repository/ogce.m2.all/cog-4_1_6_rc2/cryptix32/cog-4_1_6/cryptix32-cog-4_1_6.pom
Downloading: http://people.apache.org/repo/m2-snapshot-repository/cog-4_1_6_rc2/cryptix32/cog-4_1_6/cryptix32-cog-4_1_6.pom
Downloading: http://mirrors.ibiblio.org/pub/mirrors/maven2/cog-4_1_6_rc2/cryptix32/cog-4_1_6/cryptix32-cog-4_1_6.pom
Downloading: http://download.java.net/maven/2/cog-4_1_6_rc2/cryptix32/cog-4_1_6/cryptix32-cog-4_1_6.pom
Downloading: http://people.apache.org/~lahiru/maven-repo/cog-4_1_6_rc2/cryptix32/cog-4_1_6/cryptix32-cog-4_1_6.pom
Downloading: http://maven.ow2.org/maven2/cog-4_1_6_rc2/cryptix32/cog-4_1_6/cryptix32-cog-4_1_6.pom
Downloading: http://repo1.maven.org/maven2/cog-4_1_6_rc2/cryptix32/cog-4_1_6/cryptix32-cog-4_1_6.pom
[WARNING] Missing POM for cog-4_1_6_rc2:cryptix32:jar:cog-4_1_6
Downloading: http://community.ucs.indiana.edu:9090/archiva/repository/ogce.m2.all/cog-4_1_6_rc2/cryptix-asn1/cog-4_1_6/cryptix-asn1-cog-4_1_6.pom
Downloading: http://people.apache.org/repo/m2-snapshot-repository/cog-4_1_6_rc2/cryptix-asn1/cog-4_1_6/cryptix-asn1-cog-4_1_6.pom
Downloading: http://mirrors.ibiblio.org/pub/mirrors/maven2/cog-4_1_6_rc2/cryptix-asn1/cog-4_1_6/cryptix-asn1-cog-4_1_6.pom
Downloading: http://download.java.net/maven/2/cog-4_1_6_rc2/cryptix-asn1/cog-4_1_6/cryptix-asn1-cog-4_1_6.pom
Downloading: http://people.apache.org/~lahiru/maven-repo/cog-4_1_6_rc2/cryptix-asn1/cog-4_1_6/cryptix-asn1-cog-4_1_6.pom
Downloading: http://maven.ow2.org/maven2/cog-4_1_6_rc2/cryptix-asn1/cog-4_1_6/cryptix-asn1-cog-4_1_6.pom
Downloading: http://repo1.maven.org/maven2/cog-4_1_6_rc2/cryptix-asn1/cog-4_1_6/cryptix-asn1-cog-4_1_6.pom
[WARNING] Missing POM for cog-4_1_6_rc2:cryptix-asn1:jar:cog-4_1_6
Downloading: http://community.ucs.indiana.edu:9090/archiva/repository/ogce.m2.all/cog-4_1_6_rc2/cryptix-asn1/cog-4_1_6/cryptix-asn1-cog-4_1_6.pom
Downloading: http://people.apache.org/repo/m2-snapshot-repository/cog-4_1_6_rc2/cryptix-asn1/cog-4_1_6/cryptix-asn1-cog-4_1_6.pom
Downloading: http://mirrors.ibiblio.org/pub/mirrors/maven2/cog-4_1_6_rc2/cryptix-asn1/cog-4_1_6/cryptix-asn1-cog-4_1_6.pom
Downloading: http://download.java.net/maven/2/cog-4_1_6_rc2/cryptix-asn1/cog-4_1_6/cryptix-asn1-cog-4_1_6.pom
Downloading: http://people.apache.org/~lahiru/maven-repo/cog-4_1_6_rc2/cryptix-asn1/cog-4_1_6/cryptix-asn1-cog-4_1_6.pom
Downloading: http://maven.ow2.org/maven2/cog-4_1_6_rc2/cryptix-asn1/cog-4_1_6/cryptix-asn1-cog-4_1_6.pom
Downloading: http://repo1.maven.org/maven2/cog-4_1_6_rc2/cryptix-asn1/cog-4_1_6/cryptix-asn1-cog-4_1_6.pom
[JENKINS] Archiving <https://builds.apache.org/job/Airavata/ws/modules/gfac-core/pom.xml>
to /home/hudson/hudson/jobs/Airavata/modules/org.apache.airavata$gfac-core/builds/2011-11-09_20-21-36/archive/org.apache.airavata/gfac-core/0.1-incubating-SNAPSHOT/gfac-core-0.1-incubating-SNAPSHOT.pom
[INFO] ------------------------------------------------------------------------
[INFO] Reactor Summary:
[INFO] 
[INFO] Airavata .......................................... SUCCESS [9.968s]
[INFO] Airavata Commons .................................. SUCCESS [0.603s]
[INFO] Airavata GFac Schema Utilities .................... SUCCESS [38.513s]
[INFO] Airavata Registry API ............................. SUCCESS [14.544s]
[INFO] Airavata-WS-Messenger ............................. SUCCESS [0.291s]
[INFO] Messenger Commons ................................. SUCCESS [2.695s]
[INFO] Messenger Client .................................. SUCCESS [3.146s]
[INFO] Airavata Workflow Tracking ........................ SUCCESS [6.352s]
[INFO] GFac-Core ......................................... FAILURE [11.182s]
[INFO] Airavata Common Utilities ......................... SKIPPED
[INFO] Airavata Workflow Execution Context ............... SKIPPED
[INFO] GFac-Axis2-Interface .............................. SKIPPED
[INFO] MessageBox ........................................ SKIPPED
[INFO] Message Broker .................................... SKIPPED
[INFO] distribution ...................................... SKIPPED
[INFO] Airavata XBaya .................................... SKIPPED
[INFO] Simple Math Service ............................... SKIPPED
[INFO] distribution ...................................... SKIPPED
[INFO] Test-Suite ........................................ SKIPPED
[INFO] ------------------------------------------------------------------------
[INFO] BUILD FAILURE
[INFO] ------------------------------------------------------------------------
[INFO] Total time: 1:39.641s
[INFO] Finished at: Wed Nov 09 20:23:25 UTC 2011
[INFO] Final Memory: 52M/147M
[INFO] ------------------------------------------------------------------------
mavenExecutionResult exceptions not empty
message : Failed to execute goal org.apache.maven.plugins:maven-remote-resources-plugin:1.2.1:process
(default) on project gfac-core: Error resolving project artifact: Could not transfer artifact
cog-4_1_6_rc2:cryptix-asn1:pom:cog-4_1_6 from/to ibiblio (http://mirrors.ibiblio.org/pub/mirrors/maven2):
Access denied to: http://mirrors.ibiblio.org/pub/mirrors/maven2/cog-4_1_6_rc2/cryptix-asn1/cog-4_1_6/cryptix-asn1-cog-4_1_6.pom
for project cog-4_1_6_rc2:cryptix-asn1:jar:cog-4_1_6
cause : Error resolving project artifact: Could not transfer artifact cog-4_1_6_rc2:cryptix-asn1:pom:cog-4_1_6
from/to ibiblio (http://mirrors.ibiblio.org/pub/mirrors/maven2): Access denied to: http://mirrors.ibiblio.org/pub/mirrors/maven2/cog-4_1_6_rc2/cryptix-asn1/cog-4_1_6/cryptix-asn1-cog-4_1_6.pom
for project cog-4_1_6_rc2:cryptix-asn1:jar:cog-4_1_6
Stack trace : 
org.apache.maven.lifecycle.LifecycleExecutionException: Failed to execute goal org.apache.maven.plugins:maven-remote-resources-plugin:1.2.1:process
(default) on project gfac-core: Error resolving project artifact: Could not transfer artifact
cog-4_1_6_rc2:cryptix-asn1:pom:cog-4_1_6 from/to ibiblio (http://mirrors.ibiblio.org/pub/mirrors/maven2):
Access denied to: http://mirrors.ibiblio.org/pub/mirrors/maven2/cog-4_1_6_rc2/cryptix-asn1/cog-4_1_6/cryptix-asn1-cog-4_1_6.pom
for project cog-4_1_6_rc2:cryptix-asn1:jar:cog-4_1_6
	at org.apache.maven.lifecycle.internal.MojoExecutor.execute(MojoExecutor.java:217)
	at org.apache.maven.lifecycle.internal.MojoExecutor.execute(MojoExecutor.java:153)
	at org.apache.maven.lifecycle.internal.MojoExecutor.execute(MojoExecutor.java:145)
	at org.apache.maven.lifecycle.internal.LifecycleModuleBuilder.buildProject(LifecycleModuleBuilder.java:84)
	at org.apache.maven.lifecycle.internal.LifecycleModuleBuilder.buildProject(LifecycleModuleBuilder.java:59)
	at org.apache.maven.lifecycle.internal.LifecycleStarter.singleThreadedBuild(LifecycleStarter.java:183)
	at org.apache.maven.lifecycle.internal.LifecycleStarter.execute(LifecycleStarter.java:161)
	at org.apache.maven.DefaultMaven.doExecute(DefaultMaven.java:319)
	at org.apache.maven.DefaultMaven.execute(DefaultMaven.java:156)
	at org.jvnet.hudson.maven3.launcher.Maven3Launcher.main(Maven3Launcher.java:79)
	at sun.reflect.NativeMethodAccessorImpl.invoke0(Native Method)
	at sun.reflect.NativeMethodAccessorImpl.invoke(NativeMethodAccessorImpl.java:39)
	at sun.reflect.DelegatingMethodAccessorImpl.invoke(DelegatingMethodAccessorImpl.java:25)
	at java.lang.reflect.Method.invoke(Method.java:597)
	at org.codehaus.plexus.classworlds.launcher.Launcher.launchStandard(Launcher.java:329)
	at org.codehaus.plexus.classworlds.launcher.Launcher.launch(Launcher.java:239)
	at org.jvnet.hudson.maven3.agent.Maven3Main.launch(Maven3Main.java:158)
	at hudson.maven.Maven3Builder.call(Maven3Builder.java:122)
	at hudson.maven.Maven3Builder.call(Maven3Builder.java:74)
	at hudson.remoting.UserRequest.perform(UserRequest.java:118)
	at hudson.remoting.UserRequest.perform(UserRequest.java:48)
	at hudson.remoting.Request$2.run(Request.java:287)
	at java.util.concurrent.Executors$RunnableAdapter.call(Executors.java:441)
	at java.util.concurrent.FutureTask$Sync.innerRun(FutureTask.java:303)
	at java.util.concurrent.FutureTask.run(FutureTask.java:138)
	at java.util.concurrent.ThreadPoolExecutor$Worker.runTask(ThreadPoolExecutor.java:886)
	at java.util.concurrent.ThreadPoolExecutor$Worker.run(ThreadPoolExecutor.java:908)
	at java.lang.Thread.run(Thread.java:662)
Caused by: org.apache.maven.plugin.MojoExecutionException: Error resolving project artifact:
Could not transfer artifact cog-4_1_6_rc2:cryptix-asn1:pom:cog-4_1_6 from/to ibiblio (http://mirrors.ibiblio.org/pub/mirrors/maven2):
Access denied to: http://mirrors.ibiblio.org/pub/mirrors/maven2/cog-4_1_6_rc2/cryptix-asn1/cog-4_1_6/cryptix-asn1-cog-4_1_6.pom
for project cog-4_1_6_rc2:cryptix-asn1:jar:cog-4_1_6
	at org.apache.maven.plugin.resources.remote.ProcessRemoteResourcesMojo.getProjects(ProcessRemoteResourcesMojo.java:696)
	at org.apache.maven.plugin.resources.remote.ProcessRemoteResourcesMojo.configureVelocityContext(ProcessRemoteResourcesMojo.java:988)
	at org.apache.maven.plugin.resources.remote.ProcessRemoteResourcesMojo.execute(ProcessRemoteResourcesMojo.java:511)
	at org.apache.maven.plugin.DefaultBuildPluginManager.executeMojo(DefaultBuildPluginManager.java:101)
	at org.apache.maven.lifecycle.internal.MojoExecutor.execute(MojoExecutor.java:209)
	... 27 more
Caused by: org.apache.maven.project.ProjectBuildingException: Error resolving project artifact:
Could not transfer artifact cog-4_1_6_rc2:cryptix-asn1:pom:cog-4_1_6 from/to ibiblio (http://mirrors.ibiblio.org/pub/mirrors/maven2):
Access denied to: http://mirrors.ibiblio.org/pub/mirrors/maven2/cog-4_1_6_rc2/cryptix-asn1/cog-4_1_6/cryptix-asn1-cog-4_1_6.pom
for project cog-4_1_6_rc2:cryptix-asn1:jar:cog-4_1_6
	at org.apache.maven.project.DefaultProjectBuilder.build(DefaultProjectBuilder.java:272)
	at org.apache.maven.project.DefaultMavenProjectBuilder.buildFromRepository(DefaultMavenProjectBuilder.java:237)
	at org.apache.maven.project.DefaultMavenProjectBuilder.buildFromRepository(DefaultMavenProjectBuilder.java:252)
	at org.apache.maven.project.DefaultMavenProjectBuilder.buildFromRepository(DefaultMavenProjectBuilder.java:259)
	at org.apache.maven.plugin.resources.remote.ProcessRemoteResourcesMojo.getProjects(ProcessRemoteResourcesMojo.java:666)
	... 31 more
Caused by: org.sonatype.aether.resolution.ArtifactResolutionException: Could not transfer
artifact cog-4_1_6_rc2:cryptix-asn1:pom:cog-4_1_6 from/to ibiblio (http://mirrors.ibiblio.org/pub/mirrors/maven2):
Access denied to: http://mirrors.ibiblio.org/pub/mirrors/maven2/cog-4_1_6_rc2/cryptix-asn1/cog-4_1_6/cryptix-asn1-cog-4_1_6.pom
	at org.sonatype.aether.impl.internal.DefaultArtifactResolver.resolve(DefaultArtifactResolver.java:541)
	at org.sonatype.aether.impl.internal.DefaultArtifactResolver.resolveArtifacts(DefaultArtifactResolver.java:220)
	at org.sonatype.aether.impl.internal.DefaultArtifactResolver.resolveArtifact(DefaultArtifactResolver.java:197)
	at org.sonatype.aether.impl.internal.DefaultRepositorySystem.resolveArtifact(DefaultRepositorySystem.java:323)
	at org.apache.maven.project.DefaultProjectBuilder.build(DefaultProjectBuilder.java:261)
	... 35 more
Caused by: org.sonatype.aether.transfer.ArtifactTransferException: Could not transfer artifact
cog-4_1_6_rc2:cryptix-asn1:pom:cog-4_1_6 from/to ibiblio (http://mirrors.ibiblio.org/pub/mirrors/maven2):
Access denied to: http://mirrors.ibiblio.org/pub/mirrors/maven2/cog-4_1_6_rc2/cryptix-asn1/cog-4_1_6/cryptix-asn1-cog-4_1_6.pom
	at org.sonatype.aether.connector.wagon.WagonRepositoryConnector$4.wrap(WagonRepositoryConnector.java:949)
	at org.sonatype.aether.connector.wagon.WagonRepositoryConnector$4.wrap(WagonRepositoryConnector.java:940)
	at org.sonatype.aether.connector.wagon.WagonRepositoryConnector$GetTask.flush(WagonRepositoryConnector.java:695)
	at org.sonatype.aether.connector.wagon.WagonRepositoryConnector$GetTask.flush(WagonRepositoryConnector.java:689)
	at org.sonatype.aether.connector.wagon.WagonRepositoryConnector.get(WagonRepositoryConnector.java:445)
	at org.sonatype.aether.impl.internal.DefaultArtifactResolver.resolve(DefaultArtifactResolver.java:460)
	... 39 more
Caused by: org.apache.maven.wagon.authorization.AuthorizationException: Access denied to:
http://mirrors.ibiblio.org/pub/mirrors/maven2/cog-4_1_6_rc2/cryptix-asn1/cog-4_1_6/cryptix-asn1-cog-4_1_6.pom
	at org.apache.maven.wagon.providers.http.LightweightHttpWagon.fillInputData(LightweightHttpWagon.java:119)
	at org.apache.maven.wagon.StreamWagon.getInputStream(StreamWagon.java:116)
	at org.apache.maven.wagon.StreamWagon.getIfNewer(StreamWagon.java:88)
	at org.apache.maven.wagon.StreamWagon.get(StreamWagon.java:61)
	at org.sonatype.aether.connector.wagon.WagonRepositoryConnector$GetTask.run(WagonRepositoryConnector.java:608)
	at org.sonatype.aether.util.concurrency.RunnableErrorForwarder$1.run(RunnableErrorForwarder.java:64)
	... 3 more
Sending e-mails to: airavata-dev@incubator.apache.org
channel stopped


Mime
View raw message