incubator-adffaces-commits mailing list archives

Site index · List index
Message view « Date » · « Thread »
Top « Date » · « Thread »
From "Continuum@myfaces.zones.apache.org" <adffaces-comm...@incubator.apache.org>
Subject [continuum] BUILD FAILURE: Apache Incubator Trinidad Podling
Date Wed, 28 Feb 2007 06:47:45 GMT
Online report : http://myfaces.zones.apache.org:8081/continuum/buildResult.action?buildId=3639&projectId=82
Build statistics:
  State: Failed
  Previous State: Ok
  Started at: Wed, 28 Feb 2007 06:46:40 +0000
  Finished at: Wed, 28 Feb 2007 06:47:34 +0000
  Total time: 53s
  Build Trigger: Forced
  Build Number: 2
  Exit code: 1
  Building machine hostname: myfaces.zones.apache.org
  Operating system : SunOS(unknown)
  Java version : 1.5.0_10(Sun Microsystems Inc.)

****************************************************************************
SCM Changes:
****************************************************************************
Changed: no author @ no date
Comment: no comment
Files changed:
  trinidad-demo/src/main/resources/META-INF/NOTICE ( no revision )
  trinidad-demo/src/main/resources/META-INF/LICENSE ( no revision )
  trinidad-demo/src/main/resources/META-INF/DISCLAIMER.txt ( no revision )
  trinidad-api/src/main/resources/META-INF/NOTICE ( no revision )
  trinidad-api/src/main/resources/META-INF/LICENSE ( no revision )
  trinidad-api/src/main/resources/META-INF/DISCLAIMER.txt ( no revision )
  trinidad-build/src/main/resources/META-INF/NOTICE ( no revision )
  trinidad-build/src/main/resources/META-INF/LICENSE ( no revision )
  trinidad-build/src/main/resources/META-INF/DISCLAIMER.txt ( no revision )
  trinidad-impl/src/main/resources/META-INF/NOTICE ( no revision )
  trinidad-impl/src/main/resources/META-INF/LICENSE ( no revision )
  trinidad-impl/src/main/resources/META-INF/DISCLAIMER.txt ( no revision )

****************************************************************************
SCM Changes since last success:
****************************************************************************
****************************************************************************
Dependencies Changes:
****************************************************************************
No dependencies changed

****************************************************************************
Test Summary:
****************************************************************************
Tests: 0
Failures: 0
Total time: 0

****************************************************************************
Output:
****************************************************************************
[INFO] Scanning for projects...
[INFO] Searching repository for plugin with prefix: 'source'.
[INFO] ----------------------------------------------------------------------------
[INFO] Building Apache Incubator Trinidad Podling
[INFO]    task-segment: [clean, install, source:jar, deploy, site-deploy]
[INFO] ----------------------------------------------------------------------------
[INFO] [clean:clean]
[INFO] Deleting directory /local/continuum-1.1-SNAPSHOT/apps/continuum/working-directory/82/target
[INFO] Deleting directory /local/continuum-1.1-SNAPSHOT/apps/continuum/working-directory/82/target/classes
[INFO] Deleting directory /local/continuum-1.1-SNAPSHOT/apps/continuum/working-directory/82/target/test-classes
[INFO] [site:attach-descriptor]
[WARNING] Unable to load parent project from repository: Could not find the model file '/local/continuum-1.1-SNAPSHOT/apps/continuum/working-directory/82/../pom.xml'.
[INFO] [install:install]
[INFO] Installing /local/continuum-1.1-SNAPSHOT/apps/continuum/working-directory/82/pom.xml
to /export/home/mrmaven/.m2/repository/org/apache/myfaces/trinidad/trinidad/1.0.1-incubating-SNAPSHOT/trinidad-1.0.1-incubating-SNAPSHOT.pom
[INFO] Preparing source:jar
[INFO] No goals needed for project - skipping
[INFO] [source:jar]
[INFO] NOT adding sources to attached artifacts for packaging: 'pom'.
[INFO] [site:attach-descriptor]
[WARNING] Unable to load parent project from repository: Could not find the model file '/local/continuum-1.1-SNAPSHOT/apps/continuum/working-directory/82/../pom.xml'.
[INFO] [install:install]
[INFO] Installing /local/continuum-1.1-SNAPSHOT/apps/continuum/working-directory/82/pom.xml
to /export/home/mrmaven/.m2/repository/org/apache/myfaces/trinidad/trinidad/1.0.1-incubating-SNAPSHOT/trinidad-1.0.1-incubating-SNAPSHOT.pom
[INFO] [deploy:deploy]
altDeploymentRepository = null
[INFO] Retrieving previous build number from apache-maven-snapshots
Uploading: scpexe://minotaur.apache.org/www/people.apache.org/repo/m2-snapshot-repository/org/apache/myfaces/trinidad/trinidad/1.0.1-incubating-SNAPSHOT/trinidad-1.0.1-incubating-SNAPSHOT.pom
[INFO] Retrieving previous metadata from apache-maven-snapshots
[INFO] Uploading repository metadata for: 'snapshot org.apache.myfaces.trinidad:trinidad:1.0.1-incubating-SNAPSHOT'
[INFO] Retrieving previous metadata from apache-maven-snapshots
[INFO] Uploading site descriptor for trinidad 1.0.1-incubating-SNAPSHOT site.xml
[INFO] Retrieving previous metadata from apache-maven-snapshots
[INFO] Uploading repository metadata for: 'artifact org.apache.myfaces.trinidad:trinidad'
[INFO] Setting property: classpath.resource.loader.class => 'org.codehaus.plexus.velocity.ContextClassLoaderResourceLoader'.
[INFO] Setting property: velocimacro.messages.on => 'false'.
[INFO] Setting property: resource.loader => 'classpath'.
[INFO] Setting property: resource.manager.logwhenfound => 'false'.
[INFO] Setting property: classpath.resource.loader.class => 'org.codehaus.plexus.velocity.ContextClassLoaderResourceLoader'.
[INFO] Setting property: velocimacro.messages.on => 'false'.
[INFO] Setting property: resource.loader => 'classpath'.
[INFO] Setting property: resource.manager.logwhenfound => 'false'.
[INFO] [site:site]
[WARNING] Unable to load parent project from repository: Could not find the model file '/local/continuum-1.1-SNAPSHOT/apps/continuum/working-directory/82/../pom.xml'.
Downloading: https://maven-repository.dev.java.net/nonav/repository//org.apache/xmls/apache-3-site_en.xml
[WARNING] Unable to get resource from repository java-net (https://maven-repository.dev.java.net/nonav/repository/)
Downloading: http://people.apache.org/repo/m2-snapshot-repository/org/apache/apache/3/apache-3-site_en.xml
[WARNING] Unable to get resource from repository apache.snapshots (http://people.apache.org/repo/m2-snapshot-repository)
Downloading: http://repo1.maven.org/maven2/org/apache/apache/3/apache-3-site_en.xml
[WARNING] Unable to get resource from repository central (http://repo1.maven.org/maven2)
Downloading: https://maven-repository.dev.java.net/nonav/repository//org.apache/xmls/apache-3-site.xml
[WARNING] Unable to get resource from repository java-net (https://maven-repository.dev.java.net/nonav/repository/)
Downloading: http://people.apache.org/repo/m2-snapshot-repository/org/apache/apache/3/apache-3-site.xml
[WARNING] Unable to get resource from repository apache.snapshots (http://people.apache.org/repo/m2-snapshot-repository)
Downloading: http://repo1.maven.org/maven2/org/apache/apache/3/apache-3-site.xml
[WARNING] Unable to get resource from repository central (http://repo1.maven.org/maven2)
[INFO] artifact org.apache.maven.skins:maven-default-skin: checking for updates from java-net
[INFO] artifact org.apache.maven.skins:maven-default-skin: checking for updates from apache.snapshots
[INFO] artifact org.apache.maven.skins:maven-default-skin: checking for updates from central
[INFO] snapshot org.apache.maven.skins:maven-default-skin:1.1-SNAPSHOT: checking for updates
from apache.snapshots
Downloading: http://people.apache.org/repo/m2-snapshot-repository/org/apache/maven/skins/maven-default-skin/1.1-SNAPSHOT/maven-default-skin-1.1-20061114.072151-2.jar
6K downloaded
[INFO] Skipped "About" report, file "index.html" already exists for the English version.
[ERROR] VM #displayTree: error : too few arguments to macro. Wanted 2 got 0
[ERROR] VM #menuItem: error : too few arguments to macro. Wanted 1 got 0
[INFO] Generate "Continuous Integration" report.
[INFO] Generate "Dependencies" report.
[INFO] Generate "Issue Tracking" report.
[INFO] Generate "Project License" report.
[INFO] Generate "Mailing Lists" report.
[INFO] Generate "Project Summary" report.
[INFO] Generate "Source Repository" report.
[INFO] Generate "Project Team" report.
[INFO] [site:deploy]
Using private key: /export/home/mrmaven/.m2/identity
scpexe://minotaur.apache.org/www/incubator.apache.org/adffaces - Session: Opened  
Executing command: ssh -i /export/home/mrmaven/.m2/identity -o "BatchMode yes" schof@minotaur.apache.org
"mkdir -p /www/incubator.apache.org/adffaces/."


Executing command: ssh -i /export/home/mrmaven/.m2/identity -o "BatchMode yes" schof@minotaur.apache.org
"mkdir -p /www/incubator.apache.org/adffaces/.
"


Uploading: ./wagon37306.zip to scpexe://minotaur.apache.org/www/incubator.apache.org/adffaces

Executing command: scp -i /export/home/mrmaven/.m2/identity -o "BatchMode yes" wagon37306.zip
schof@minotaur.apache.org:/www/incubator.apache.org/adffaces/./wagon37306.zip
scpexe://minotaur.apache.org/www/incubator.apache.org/adffaces - Session: Disconnecting  
scpexe://minotaur.apache.org/www/incubator.apache.org/adffaces - Session: Disconnected
[INFO] ------------------------------------------------------------------------
[ERROR] BUILD ERROR
[INFO] ------------------------------------------------------------------------
[INFO] Error uploading site

Embedded error: Exit code: 1 - scp: /www/incubator.apache.org/adffaces/./wagon37306.zip: Permission
denied

[INFO] ------------------------------------------------------------------------
[INFO] For more information, run Maven with the -e switch
[INFO] ------------------------------------------------------------------------
[INFO] Total time: 50 seconds
[INFO] Finished at: Wed Feb 28 06:47:33 GMT+00:00 2007
[INFO] Final Memory: 15M/75M
[INFO] ------------------------------------------------------------------------

****************************************************************************



Mime
View raw message