incubator-adffaces-commits mailing list archives

Site index · List index
Message view « Date » · « Thread »
Top « Date » · « Thread »
From "Continuum@myfaces.zones.apache.org" <mrma...@myfaces.zones.apache.org>
Subject [continuum] BUILD FAILURE: Apache Trinidad Impl
Date Mon, 05 Feb 2007 09:10:33 GMT
Online report : http://myfaces.zones.apache.org:8080/continuum/servlet/continuum/target/ProjectBuild.vm/view/ProjectBuild/id/149/buildId/8508
Build statistics:
  State: Failed
  Previous State: Ok
  Started at: Mon, 5 Feb 2007 09:08:05 +0000
  Finished at: Mon, 5 Feb 2007 09:10:32 +0000
  Total time: 2m 27s
  Build Trigger: Schedule
  Exit code: 1
  Building machine hostname: myfaces.zones.apache.org
  Operating system : SunOS(unknown)
  Java version : 1.5.0_10(Sun Microsystems Inc.)

Changes
         matzew          using multiple args in TrMessageFactory.createMessage
             /incubator/adffaces/trunk/trinidad/trinidad-impl/src/main/javascript/META-INF/adf/jsLibs/Locale.js
           matzew          ensure that no 1970 date (meaning null as date value) will be used.
             /incubator/adffaces/trunk/trinidad/trinidad-impl/src/main/javascript/META-INF/adf/jsLibs/CoreFormat.js
        
****************************************************************************
Output:
****************************************************************************
[INFO] Scanning for projects...
[INFO] Searching repository for plugin with prefix: 'source'.
[INFO] ----------------------------------------------------------------------------
[INFO] Building Apache Trinidad Impl
[INFO]    task-segment: [clean, install, source:jar, deploy]
[INFO] ----------------------------------------------------------------------------
[INFO] snapshot org.apache.myfaces.trinidadbuild:maven-faces-plugin:incubator-m1-SNAPSHOT:
checking for updates from apache.snapshots
[INFO] snapshot org.apache.myfaces.trinidadbuild:maven-i18n-plugin:incubator-m1-SNAPSHOT:
checking for updates from apache.snapshots
[INFO] snapshot org.apache.myfaces.trinidadbuild:maven-javascript-plugin:incubator-m1-SNAPSHOT:
checking for updates from apache.snapshots
[INFO] snapshot org.apache.myfaces.trinidadbuild:maven-xrts-plugin:incubator-m1-SNAPSHOT:
checking for updates from apache.snapshots
[INFO] [clean:clean]
[INFO] Deleting directory /local/continuum-1.0.3-SNAPSHOT/apps/continuum/working-directory/149/target
[INFO] Deleting directory /local/continuum-1.0.3-SNAPSHOT/apps/continuum/working-directory/149/target/classes
[INFO] Deleting directory /local/continuum-1.0.3-SNAPSHOT/apps/continuum/working-directory/149/target/test-classes
[INFO] snapshot org.apache.myfaces.trinidad:trinidad-api:incubator-m1-SNAPSHOT: checking for
updates from apache.snapshots
[INFO] snapshot org.apache.myfaces.trinidad:trinidad-build:incubator-m1-SNAPSHOT: checking
for updates from apache.snapshots
[INFO] [faces:generate-jsp-taglibs {execution: default}]
[INFO] Generated 141 JSP tag(s)
[INFO] [faces:generate-facelets-taglibs {execution: default}]
[INFO] Generated META-INF/tr.taglib.xml
[INFO] Generated META-INF/trh.taglib.xml
[INFO] [i18n:generate-locale-elements {execution: default}]
[INFO] Generating LocaleElements
[INFO] [i18n:generate-javascript-locales {execution: default}]
[INFO] Generating Javascript Locales
[INFO] [javascript:reduce-javascript {execution: default}]
[INFO] [xrts:generate-sources {execution: default}]
[INFO] Generating 32 XRTS bundles to /local/continuum-1.0.3-SNAPSHOT/apps/continuum/working-directory/149/target/maven-xrts-plugin/main/java
[INFO] [faces:generate-faces-config {execution: default}]
[INFO] Generated META-INF/faces-config.xml
[INFO] [resources:resources]
[INFO] Using default encoding to copy filtered resources.
[INFO] [compiler:compile]
Compiling 1128 source files to /local/continuum-1.0.3-SNAPSHOT/apps/continuum/working-directory/149/target/classes
[INFO] ------------------------------------------------------------------------
[ERROR] BUILD FAILURE
[INFO] ------------------------------------------------------------------------
[INFO] Compilation failure

/local/continuum-1.0.3-SNAPSHOT/apps/continuum/working-directory/149/src/main/java/org/apache/myfaces/trinidadinternal/config/upload/ServletUploadedExternalContext.java:[28,43]
cannot find symbol
symbol  : class ExternalContextDecorator
location: package org.apache.myfaces.trinidad.context

/local/continuum-1.0.3-SNAPSHOT/apps/continuum/working-directory/149/src/main/java/org/apache/myfaces/trinidadinternal/config/upload/ServletUploadedExternalContext.java:[39,45]
cannot find symbol
symbol: class ExternalContextDecorator
class ServletUploadedExternalContext extends ExternalContextDecorator

/local/continuum-1.0.3-SNAPSHOT/apps/continuum/working-directory/149/src/main/java/org/apache/myfaces/trinidadinternal/config/GlobalConfiguratorImpl.java:[28,42]
cannot find symbol
symbol  : class Configurator
location: package org.apache.myfaces.trinidad.config

/local/continuum-1.0.3-SNAPSHOT/apps/continuum/working-directory/149/src/main/java/org/apache/myfaces/trinidadinternal/config/GlobalConfiguratorImpl.java:[52,44]
cannot find symbol
symbol: class Configurator
public class GlobalConfiguratorImpl extends Configurator

/local/continuum-1.0.3-SNAPSHOT/apps/continuum/working-directory/149/src/main/java/org/apache/myfaces/trinidadinternal/config/GlobalConfiguratorImpl.java:[441,15]
cannot find symbol
symbol  : class Configurator
location: class org.apache.myfaces.trinidadinternal.config.GlobalConfiguratorImpl

/local/continuum-1.0.3-SNAPSHOT/apps/continuum/working-directory/149/src/main/java/org/apache/myfaces/trinidadinternal/facelets/TrinidadListenersTagRule.java:[29,27]
[deprecation] com.sun.facelets.el.LegacyMethodBinding in com.sun.facelets.el has been deprecated

/local/continuum-1.0.3-SNAPSHOT/apps/continuum/working-directory/149/src/main/java/org/apache/myfaces/trinidadinternal/facelets/ReturnActionListenerTag.java:[33,27]
[deprecation] com.sun.facelets.el.LegacyValueBinding in com.sun.facelets.el has been deprecated

/local/continuum-1.0.3-SNAPSHOT/apps/continuum/working-directory/149/src/main/java/org/apache/myfaces/trinidadinternal/config/upload/PortletUploadedExternalContext.java:[33,43]
cannot find symbol
symbol  : class ExternalContextDecorator
location: package org.apache.myfaces.trinidad.context

/local/continuum-1.0.3-SNAPSHOT/apps/continuum/working-directory/149/src/main/java/org/apache/myfaces/trinidadinternal/config/upload/PortletUploadedExternalContext.java:[47,45]
cannot find symbol
symbol: class ExternalContextDecorator
class PortletUploadedExternalContext extends ExternalContextDecorator

/local/continuum-1.0.3-SNAPSHOT/apps/continuum/working-directory/149/src/main/java/org/apache/myfaces/trinidadinternal/config/upload/FileUploadConfiguratorImpl.java:[30,42]
cannot find symbol
symbol  : class Configurator
location: package org.apache.myfaces.trinidad.config

/local/continuum-1.0.3-SNAPSHOT/apps/continuum/working-directory/149/src/main/java/org/apache/myfaces/trinidadinternal/config/upload/FileUploadConfiguratorImpl.java:[44,48]
cannot find symbol
symbol: class Configurator
public class FileUploadConfiguratorImpl extends Configurator

/local/continuum-1.0.3-SNAPSHOT/apps/continuum/working-directory/149/src/main/java/org/apache/myfaces/trinidadinternal/config/dispatch/DispatchResponseConfiguratorImpl.java:[34,42]
cannot find symbol
symbol  : class Configurator
location: package org.apache.myfaces.trinidad.config

/local/continuum-1.0.3-SNAPSHOT/apps/continuum/working-directory/149/src/main/java/org/apache/myfaces/trinidadinternal/config/dispatch/DispatchResponseConfiguratorImpl.java:[35,43]
cannot find symbol
symbol  : class ExternalContextDecorator
location: package org.apache.myfaces.trinidad.context

/local/continuum-1.0.3-SNAPSHOT/apps/continuum/working-directory/149/src/main/java/org/apache/myfaces/trinidadinternal/config/dispatch/DispatchResponseConfiguratorImpl.java:[46,54]
cannot find symbol
symbol: class Configurator
public class DispatchResponseConfiguratorImpl extends Configurator

/local/continuum-1.0.3-SNAPSHOT/apps/continuum/working-directory/149/src/main/java/org/apache/myfaces/trinidadinternal/config/dispatch/DispatchResponseConfiguratorImpl.java:[85,47]
cannot find symbol
symbol  : class ExternalContextDecorator
location: class org.apache.myfaces.trinidadinternal.config.dispatch.DispatchResponseConfiguratorImpl

/local/continuum-1.0.3-SNAPSHOT/apps/continuum/working-directory/149/src/main/java/org/apache/myfaces/trinidadinternal/config/dispatch/DispatchResponseConfiguratorImpl.java:[113,47]
cannot find symbol
symbol  : class ExternalContextDecorator
location: class org.apache.myfaces.trinidadinternal.config.dispatch.DispatchResponseConfiguratorImpl

/local/continuum-1.0.3-SNAPSHOT/apps/continuum/working-directory/149/src/main/java/org/apache/myfaces/trinidadinternal/facelets/SetActionListenerTag.java:[30,27]
[deprecation] com.sun.facelets.el.LegacyValueBinding in com.sun.facelets.el has been deprecated

/local/continuum-1.0.3-SNAPSHOT/apps/continuum/working-directory/149/src/main/java/org/apache/myfaces/trinidadinternal/context/FacesContextFactoryImpl.java:[35,43]
cannot find symbol
symbol  : class ExternalContextDecorator
location: package org.apache.myfaces.trinidad.context

/local/continuum-1.0.3-SNAPSHOT/apps/continuum/working-directory/149/src/main/java/org/apache/myfaces/trinidadinternal/context/FacesContextFactoryImpl.java:[266,47]
cannot find symbol
symbol  : class ExternalContextDecorator
location: class org.apache.myfaces.trinidadinternal.context.FacesContextFactoryImpl

/local/continuum-1.0.3-SNAPSHOT/apps/continuum/working-directory/149/src/main/java/org/apache/myfaces/trinidadinternal/context/TrinidadPhaseListener.java:[174,27]
createContext(java.lang.Object,java.lang.Object) in org.apache.myfaces.trinidad.context.RequestContextFactory
cannot be applied to (javax.faces.context.ExternalContext)

/local/continuum-1.0.3-SNAPSHOT/apps/continuum/working-directory/149/src/main/java/org/apache/myfaces/trinidadinternal/config/upload/ServletUploadedExternalContext.java:[56,3]
method does not override a method from its superclass

/local/continuum-1.0.3-SNAPSHOT/apps/continuum/working-directory/149/src/main/java/org/apache/myfaces/trinidadinternal/config/upload/ServletUploadedExternalContext.java:[65,3]
method does not override a method from its superclass

/local/continuum-1.0.3-SNAPSHOT/apps/continuum/working-directory/149/src/main/java/org/apache/myfaces/trinidadinternal/config/upload/ServletUploadedExternalContext.java:[78,3]
method does not override a method from its superclass

/local/continuum-1.0.3-SNAPSHOT/apps/continuum/working-directory/149/src/main/java/org/apache/myfaces/trinidadinternal/config/upload/ServletUploadedExternalContext.java:[98,3]
method does not override a method from its superclass

/local/continuum-1.0.3-SNAPSHOT/apps/continuum/working-directory/149/src/main/java/org/apache/myfaces/trinidadinternal/config/upload/ServletUploadedExternalContext.java:[117,3]
method does not override a method from its superclass

/local/continuum-1.0.3-SNAPSHOT/apps/continuum/working-directory/149/src/main/java/org/apache/myfaces/trinidadinternal/ui/laf/base/xhtml/StyledTextRenderer.java:[284,51]
[deprecation] DESCRIPTION_ATTR in org.apache.myfaces.trinidadinternal.ui.UIConstants has been
deprecated

/local/continuum-1.0.3-SNAPSHOT/apps/continuum/working-directory/149/src/main/java/org/apache/myfaces/trinidadinternal/convert/ConverterUtils.java:[184,23]
[dep-ann] deprecated name isnt annotated with @Deprecated

/local/continuum-1.0.3-SNAPSHOT/apps/continuum/working-directory/149/src/main/java/org/apache/myfaces/trinidadinternal/convert/ConverterUtils.java:[276,23]
[dep-ann] deprecated name isnt annotated with @Deprecated

/local/continuum-1.0.3-SNAPSHOT/apps/continuum/working-directory/149/src/main/java/org/apache/myfaces/trinidadinternal/config/GlobalConfiguratorImpl.java:[78,19]
operator == cannot be applied to org.apache.myfaces.trinidadinternal.config.GlobalConfiguratorImpl,<nulltype>

/local/continuum-1.0.3-SNAPSHOT/apps/continuum/working-directory/149/src/main/java/org/apache/myfaces/trinidadinternal/config/GlobalConfiguratorImpl.java:[128,13]
cannot find symbol
symbol  : method isConfiguratorServiceDisabled(javax.faces.context.ExternalContext)
location: class org.apache.myfaces.trinidadinternal.config.GlobalConfiguratorImpl

/local/continuum-1.0.3-SNAPSHOT/apps/continuum/working-directory/149/src/main/java/org/apache/myfaces/trinidadinternal/config/GlobalConfiguratorImpl.java:[133,22]
cannot find symbol
symbol  : method isConfiguratorServiceDisabled(javax.faces.context.ExternalContext)
location: class org.apache.myfaces.trinidadinternal.config.GlobalConfiguratorImpl

/local/continuum-1.0.3-SNAPSHOT/apps/continuum/working-directory/149/src/main/java/org/apache/myfaces/trinidadinternal/config/GlobalConfiguratorImpl.java:[167,3]
method does not override a method from its superclass

/local/continuum-1.0.3-SNAPSHOT/apps/continuum/working-directory/149/src/main/java/org/apache/myfaces/trinidadinternal/config/GlobalConfiguratorImpl.java:[231,17]
cannot find symbol
symbol  : class Configurator
location: class org.apache.myfaces.trinidadinternal.config.GlobalConfiguratorImpl

/local/continuum-1.0.3-SNAPSHOT/apps/continuum/working-directory/149/src/main/java/org/apache/myfaces/trinidadinternal/config/GlobalConfiguratorImpl.java:[226,3]
method does not override a method from its superclass

/local/continuum-1.0.3-SNAPSHOT/apps/continuum/working-directory/149/src/main/java/org/apache/myfaces/trinidadinternal/config/GlobalConfiguratorImpl.java:[254,3]
method does not override a method from its superclass

/local/continuum-1.0.3-SNAPSHOT/apps/continuum/working-directory/149/src/main/java/org/apache/myfaces/trinidadinternal/config/GlobalConfiguratorImpl.java:[304,17]
cannot find symbol
symbol  : class Configurator
location: class org.apache.myfaces.trinidadinternal.config.GlobalConfiguratorImpl

/local/continuum-1.0.3-SNAPSHOT/apps/continuum/working-directory/149/src/main/java/org/apache/myfaces/trinidadinternal/config/GlobalConfiguratorImpl.java:[293,3]
method does not override a method from its superclass

/local/continuum-1.0.3-SNAPSHOT/apps/continuum/working-directory/149/src/main/java/org/apache/myfaces/trinidadinternal/config/GlobalConfiguratorImpl.java:[332,47]
cannot find symbol
symbol  : class Configurator
location: class org.apache.myfaces.trinidadinternal.config.GlobalConfiguratorImpl

/local/continuum-1.0.3-SNAPSHOT/apps/continuum/working-directory/149/src/main/java/org/apache/myfaces/trinidadinternal/config/GlobalConfiguratorImpl.java:[349,17]
cannot find symbol
symbol  : class Configurator
location: class org.apache.myfaces.trinidadinternal.config.GlobalConfiguratorImpl

/local/continuum-1.0.3-SNAPSHOT/apps/continuum/working-directory/149/src/main/java/org/apache/myfaces/trinidadinternal/config/GlobalConfiguratorImpl.java:[325,3]
method does not override a method from its superclass

/local/continuum-1.0.3-SNAPSHOT/apps/continuum/working-directory/149/src/main/java/org/apache/myfaces/trinidadinternal/config/GlobalConfiguratorImpl.java:[405,23]
createContext(java.lang.Object,java.lang.Object) in org.apache.myfaces.trinidad.context.RequestContextFactory
cannot be applied to (javax.faces.context.ExternalContext)

/local/continuum-1.0.3-SNAPSHOT/apps/continuum/working-directory/149/src/main/java/org/apache/myfaces/trinidadinternal/config/GlobalConfiguratorImpl.java:[417,15]
cannot find symbol
symbol  : class Configurator
location: class org.apache.myfaces.trinidadinternal.config.GlobalConfiguratorImpl

/local/continuum-1.0.3-SNAPSHOT/apps/continuum/working-directory/149/src/main/java/org/apache/myfaces/trinidadinternal/config/GlobalConfiguratorImpl.java:[427,29]
cannot find symbol
symbol  : method isConfiguratorServiceDisabled(javax.faces.context.ExternalContext)
location: class org.apache.myfaces.trinidadinternal.config.GlobalConfiguratorImpl

/local/continuum-1.0.3-SNAPSHOT/apps/continuum/working-directory/149/src/main/java/org/apache/myfaces/trinidadinternal/config/GlobalConfiguratorImpl.java:[433,15]
cannot find symbol
symbol  : class Configurator
location: class org.apache.myfaces.trinidadinternal.config.GlobalConfiguratorImpl

/local/continuum-1.0.3-SNAPSHOT/apps/continuum/working-directory/149/src/main/java/org/apache/myfaces/trinidadinternal/config/GlobalConfiguratorImpl.java:[443,40]
type parameter org.apache.myfaces.trinidadinternal.config.GlobalConfiguratorImpl is not within
its bound

/local/continuum-1.0.3-SNAPSHOT/apps/continuum/working-directory/149/src/main/java/org/apache/myfaces/trinidadinternal/config/GlobalConfiguratorImpl.java:[443,106]
type parameter org.apache.myfaces.trinidadinternal.config.GlobalConfiguratorImpl is not within
its bound

/local/continuum-1.0.3-SNAPSHOT/apps/continuum/working-directory/149/src/main/java/org/apache/myfaces/trinidadinternal/renderkit/core/xhtml/StyleSheetRenderer.java:[144,53]
cannot find symbol
symbol  : method getStyleClassMap(org.apache.myfaces.trinidad.context.RenderingContext)
location: class org.apache.myfaces.trinidad.skin.Skin

/local/continuum-1.0.3-SNAPSHOT/apps/continuum/working-directory/149/src/main/java/org/apache/myfaces/trinidadinternal/ui/laf/xml/parse/RendererNodeParser.java:[56,39]
[deprecation] create(org.apache.myfaces.trinidadinternal.share.xml.ParseContext,java.lang.String,java.lang.String)
in org.apache.myfaces.trinidadinternal.share.xml.NamespaceURI has been deprecated

/local/continuum-1.0.3-SNAPSHOT/apps/continuum/working-directory/149/src/main/java/org/apache/myfaces/trinidadinternal/share/util/CaboHttpUtils.java:[82,10]
[deprecation] getBytes(int,int,byte[],int) in java.lang.String has been deprecated

/local/continuum-1.0.3-SNAPSHOT/apps/continuum/working-directory/149/src/main/java/org/apache/myfaces/trinidadinternal/share/io/ServletNameResolver.java:[70,30]
[deprecation] getRealPath(java.lang.String) in javax.servlet.ServletRequest has been deprecated

/local/continuum-1.0.3-SNAPSHOT/apps/continuum/working-directory/149/src/main/java/org/apache/myfaces/trinidadinternal/context/RequestContextFactoryImpl.java:[54,3]
method does not override a method from its superclass

/local/continuum-1.0.3-SNAPSHOT/apps/continuum/working-directory/149/src/main/java/org/apache/myfaces/trinidadinternal/config/upload/UploadedFileProcessorImpl.java:[175,13]
[unchecked] unchecked conversion
found   : org.apache.myfaces.trinidadinternal.context.external.ServletInitParameterMap
required: java.util.Map<java.lang.String,java.lang.String>

/local/continuum-1.0.3-SNAPSHOT/apps/continuum/working-directory/149/src/main/java/org/apache/myfaces/trinidadinternal/config/upload/UploadedFileProcessorImpl.java:[185,13]
[unchecked] unchecked conversion
found   : org.apache.myfaces.trinidadinternal.context.external.PortletInitParameterMap
required: java.util.Map<java.lang.String,java.lang.String>

/local/continuum-1.0.3-SNAPSHOT/apps/continuum/working-directory/149/src/main/java/org/apache/myfaces/trinidadinternal/renderkit/core/CoreRenderingContext.java:[421,81]
[unchecked] unchecked conversion
found   : java.util.Map
required: java.util.Map<java.lang.String,java.lang.Object>

/local/continuum-1.0.3-SNAPSHOT/apps/continuum/working-directory/149/src/main/java/org/apache/myfaces/trinidadinternal/config/upload/PortletUploadedExternalContext.java:[64,3]
method does not override a method from its superclass

/local/continuum-1.0.3-SNAPSHOT/apps/continuum/working-directory/149/src/main/java/org/apache/myfaces/trinidadinternal/config/upload/PortletUploadedExternalContext.java:[73,3]
method does not override a method from its superclass

/local/continuum-1.0.3-SNAPSHOT/apps/continuum/working-directory/149/src/main/java/org/apache/myfaces/trinidadinternal/config/upload/PortletUploadedExternalContext.java:[86,3]
method does not override a method from its superclass

/local/continuum-1.0.3-SNAPSHOT/apps/continuum/working-directory/149/src/main/java/org/apache/myfaces/trinidadinternal/config/upload/PortletUploadedExternalContext.java:[106,3]
method does not override a method from its superclass

/local/continuum-1.0.3-SNAPSHOT/apps/continuum/working-directory/149/src/main/java/org/apache/myfaces/trinidadinternal/config/upload/PortletUploadedExternalContext.java:[125,3]
method does not override a method from its superclass

/local/continuum-1.0.3-SNAPSHOT/apps/continuum/working-directory/149/src/main/java/org/apache/myfaces/trinidadinternal/config/ConfigParser.java:[227,35]
[unchecked] unchecked call to put(K,V) as a member of the raw type java.util.Map

/local/continuum-1.0.3-SNAPSHOT/apps/continuum/working-directory/149/src/main/java/org/apache/myfaces/trinidadinternal/ui/laf/base/xhtml/XhtmlLafUtils.java:[314,36]
cannot find symbol
symbol  : method getStyleClassMap(org.apache.myfaces.trinidad.context.RenderingContext)
location: class org.apache.myfaces.trinidad.skin.Skin

/local/continuum-1.0.3-SNAPSHOT/apps/continuum/working-directory/149/src/main/java/org/apache/myfaces/trinidadinternal/config/upload/FileUploadConfiguratorImpl.java:[84,3]
method does not override a method from its superclass

/local/continuum-1.0.3-SNAPSHOT/apps/continuum/working-directory/149/src/main/java/org/apache/myfaces/trinidadinternal/config/upload/FileUploadConfiguratorImpl.java:[160,3]
method does not override a method from its superclass

/local/continuum-1.0.3-SNAPSHOT/apps/continuum/working-directory/149/src/main/java/org/apache/myfaces/trinidadinternal/config/upload/FileUploadConfiguratorImpl.java:[187,4]
cannot find symbol
symbol  : variable super
location: class org.apache.myfaces.trinidadinternal.config.upload.FileUploadConfiguratorImpl

/local/continuum-1.0.3-SNAPSHOT/apps/continuum/working-directory/149/src/main/java/org/apache/myfaces/trinidadinternal/config/upload/FileUploadConfiguratorImpl.java:[184,3]
method does not override a method from its superclass

/local/continuum-1.0.3-SNAPSHOT/apps/continuum/working-directory/149/src/main/java/org/apache/myfaces/trinidadinternal/config/upload/FileUploadConfiguratorImpl.java:[221,15]
incompatible types
found   : org.apache.myfaces.trinidadinternal.config.upload.ServletUploadedExternalContext
required: javax.faces.context.ExternalContext

/local/continuum-1.0.3-SNAPSHOT/apps/continuum/working-directory/149/src/main/java/org/apache/myfaces/trinidadinternal/config/upload/FileUploadConfiguratorImpl.java:[231,15]
incompatible types
found   : org.apache.myfaces.trinidadinternal.config.upload.PortletUploadedExternalContext
required: javax.faces.context.ExternalContext

/local/continuum-1.0.3-SNAPSHOT/apps/continuum/working-directory/149/src/main/java/org/apache/myfaces/trinidadinternal/config/dispatch/DispatchResponseConfiguratorImpl.java:[62,17]
incompatible types
found   : org.apache.myfaces.trinidadinternal.config.dispatch.DispatchResponseConfiguratorImpl.PortletExternalContext
required: javax.faces.context.ExternalContext

/local/continuum-1.0.3-SNAPSHOT/apps/continuum/working-directory/149/src/main/java/org/apache/myfaces/trinidadinternal/config/dispatch/DispatchResponseConfiguratorImpl.java:[68,15]
incompatible types
found   : org.apache.myfaces.trinidadinternal.config.dispatch.DispatchResponseConfiguratorImpl.ServletExternalContext
required: javax.faces.context.ExternalContext

/local/continuum-1.0.3-SNAPSHOT/apps/continuum/working-directory/149/src/main/java/org/apache/myfaces/trinidadinternal/config/dispatch/DispatchResponseConfiguratorImpl.java:[49,3]
method does not override a method from its superclass

/local/continuum-1.0.3-SNAPSHOT/apps/continuum/working-directory/149/src/main/java/org/apache/myfaces/trinidadinternal/config/dispatch/DispatchResponseConfiguratorImpl.java:[92,5]
method does not override a method from its superclass

/local/continuum-1.0.3-SNAPSHOT/apps/continuum/working-directory/149/src/main/java/org/apache/myfaces/trinidadinternal/config/dispatch/DispatchResponseConfiguratorImpl.java:[103,5]
method does not override a method from its superclass

/local/continuum-1.0.3-SNAPSHOT/apps/continuum/working-directory/149/src/main/java/org/apache/myfaces/trinidadinternal/config/dispatch/DispatchResponseConfiguratorImpl.java:[120,5]
method does not override a method from its superclass

/local/continuum-1.0.3-SNAPSHOT/apps/continuum/working-directory/149/src/main/java/org/apache/myfaces/trinidadinternal/config/dispatch/DispatchResponseConfiguratorImpl.java:[126,5]
method does not override a method from its superclass

/local/continuum-1.0.3-SNAPSHOT/apps/continuum/working-directory/149/src/main/java/org/apache/myfaces/trinidadinternal/config/dispatch/DispatchResponseConfiguratorImpl.java:[139,49]
cannot find symbol
symbol  : method getRequest()
location: class org.apache.myfaces.trinidadinternal.config.dispatch.DispatchResponseConfiguratorImpl.PortletExternalContext

/local/continuum-1.0.3-SNAPSHOT/apps/continuum/working-directory/149/src/main/java/org/apache/myfaces/trinidadinternal/config/dispatch/DispatchResponseConfiguratorImpl.java:[132,5]
method does not override a method from its superclass

/local/continuum-1.0.3-SNAPSHOT/apps/continuum/working-directory/149/src/main/java/org/apache/myfaces/trinidadinternal/config/dispatch/DispatchResponseConfiguratorImpl.java:[154,5]
method does not override a method from its superclass

/local/continuum-1.0.3-SNAPSHOT/apps/continuum/working-directory/149/src/main/java/org/apache/myfaces/trinidadinternal/share/nls/MutableLocaleContext.java:[102,14]
[deprecation] setReadingDirection(int) in org.apache.myfaces.trinidadinternal.share.nls.LocaleContextImpl
has been deprecated

/local/continuum-1.0.3-SNAPSHOT/apps/continuum/working-directory/149/src/main/java/org/apache/myfaces/trinidadinternal/share/nls/MutableLocaleContext.java:[106,9]
[deprecation] setReadingDirection(int) in org.apache.myfaces.trinidadinternal.share.nls.LocaleContextImpl
has been deprecated

/local/continuum-1.0.3-SNAPSHOT/apps/continuum/working-directory/149/src/main/java/org/apache/myfaces/trinidadinternal/share/nls/MutableLocaleContext.java:[114,14]
[deprecation] setTimeZone(java.util.TimeZone) in org.apache.myfaces.trinidadinternal.share.nls.LocaleContextImpl
has been deprecated

/local/continuum-1.0.3-SNAPSHOT/apps/continuum/working-directory/149/src/main/java/org/apache/myfaces/trinidadinternal/share/nls/MutableLocaleContext.java:[118,9]
[deprecation] setTimeZone(java.util.TimeZone) in org.apache.myfaces.trinidadinternal.share.nls.LocaleContextImpl
has been deprecated

/local/continuum-1.0.3-SNAPSHOT/apps/continuum/working-directory/149/src/main/java/org/apache/myfaces/trinidadinternal/context/FacesContextFactoryImpl.java:[106,18]
incompatible types
found   : org.apache.myfaces.trinidadinternal.context.FacesContextFactoryImpl.OverrideDispatch
required: javax.faces.context.ExternalContext

/local/continuum-1.0.3-SNAPSHOT/apps/continuum/working-directory/149/src/main/java/org/apache/myfaces/trinidadinternal/context/FacesContextFactoryImpl.java:[282,6]
non-static variable super cannot be referenced from a static context

/local/continuum-1.0.3-SNAPSHOT/apps/continuum/working-directory/149/src/main/java/org/apache/myfaces/trinidadinternal/context/FacesContextFactoryImpl.java:[282,11]
cannot find symbol
symbol  : method dispatch(java.lang.String)
location: class javax.faces.context.FacesContextFactory

/local/continuum-1.0.3-SNAPSHOT/apps/continuum/working-directory/149/src/main/java/org/apache/myfaces/trinidadinternal/context/FacesContextFactoryImpl.java:[273,5]
method does not override a method from its superclass

/local/continuum-1.0.3-SNAPSHOT/apps/continuum/working-directory/149/src/main/java/org/apache/myfaces/trinidadinternal/context/FacesContextFactoryImpl.java:[286,5]
method does not override a method from its superclass

/local/continuum-1.0.3-SNAPSHOT/apps/continuum/working-directory/149/src/main/java/org/apache/myfaces/trinidadinternal/renderkit/RenderUtils.java:[32,7]
[dep-ann] deprecated name isnt annotated with @Deprecated

/local/continuum-1.0.3-SNAPSHOT/apps/continuum/working-directory/149/src/main/java/org/apache/myfaces/trinidadinternal/share/util/MultipartFormHandler.java:[78,39]
[unchecked] unchecked call to put(K,V) as a member of the raw type java.util.Map

/local/continuum-1.0.3-SNAPSHOT/apps/continuum/working-directory/149/src/main/java/org/apache/myfaces/trinidadinternal/application/StateManagerImpl.java:[842,57]
[unchecked] unchecked cast
found   : java.util.List
required: java.util.List<javax.faces.component.UIComponent>

/local/continuum-1.0.3-SNAPSHOT/apps/continuum/working-directory/149/src/main/java/org/apache/myfaces/trinidadinternal/application/StateManagerImpl.java:[843,36]
[unchecked] unchecked call to addAll(java.util.Collection<? extends E>) as a member
of the raw type java.util.List


[INFO] ------------------------------------------------------------------------
[INFO] For more information, run Maven with the -e switch
[INFO] ------------------------------------------------------------------------
[INFO] Total time: 2 minutes 25 seconds
[INFO] Finished at: Mon Feb 05 09:10:31 GMT+00:00 2007
[INFO] Final Memory: 10M/119M
[INFO] ------------------------------------------------------------------------

****************************************************************************



Mime
View raw message