incubator-adffaces-commits mailing list archives

Site index · List index
Message view « Date » · « Thread »
Top « Date » · « Thread »
From "Continuum@myfaces.zones.apache.org" <mrma...@myfaces.zones.apache.org>
Subject [continuum] BUILD FAILURE: Apache Trinidad Build
Date Tue, 27 Feb 2007 17:02:44 GMT
Online report : http://myfaces.zones.apache.org:8080/continuum/servlet/continuum/target/ProjectBuild.vm/view/ProjectBuild/id/148/buildId/9067
Build statistics:
  State: Failed
  Previous State: Ok
  Started at: Tue, 27 Feb 2007 17:02:41 +0000
  Finished at: Tue, 27 Feb 2007 17:02:44 +0000
  Total time: 2s
  Build Trigger: Schedule
  Exit code: 1
  Building machine hostname: myfaces.zones.apache.org
  Operating system : SunOS(unknown)
  Java version : 1.5.0_10(Sun Microsystems Inc.)

Changes
         matzew          changed trunk version to 1.0.1-incubating-SNAPSHOT and also using
plugins from trunk (1.0.1-incubating-SNAPSHOT as well)
             /incubator/adffaces/trunk/trinidad/pom.xml
            /incubator/adffaces/trunk/trinidad/trinidad-api/pom.xml
            /incubator/adffaces/trunk/trinidad/trinidad-build/pom.xml
            /incubator/adffaces/trunk/trinidad/trinidad-demo/pom.xml
            /incubator/adffaces/trunk/trinidad/trinidad-impl/pom.xml
        
****************************************************************************
Output:
****************************************************************************
+ Error stacktraces are turned on.
Maven version: 2.0.4
[DEBUG] Building Maven user-level plugin registry from: '/export/home/mrmaven/.m2/plugin-registry.xml'
[DEBUG] Building Maven global-level plugin registry from: '/local/maven-2.0.4/conf/plugin-registry.xml'
[INFO] Scanning for projects...
[DEBUG] Searching for parent-POM: org.apache.myfaces.trinidad:trinidad::1.0.1-incubating-SNAPSHOT
of project: null:trinidad-build:jar:null in relative path: ../pom.xml
[DEBUG] Parent-POM: org.apache.myfaces.trinidad:trinidad::1.0.1-incubating-SNAPSHOT not found
in relative path: ../pom.xml
[DEBUG] Retrieving parent-POM: org.apache.myfaces.trinidad:trinidad::1.0.1-incubating-SNAPSHOT
for project: null:trinidad-build:jar:null from the repository.
[DEBUG] Skipping disabled repository central
[DEBUG] trinidad: using locally installed snapshot
[DEBUG] Searching for parent-POM: org.apache:apache::3 of project: org.apache.myfaces.trinidad:trinidad:pom:1.0.1-incubating-SNAPSHOT
in relative path: ../pom.xml
[DEBUG] Parent-POM: org.apache:apache::3 not found in relative path: ../pom.xml
[DEBUG] Retrieving parent-POM: org.apache:apache::3 for project: org.apache.myfaces.trinidad:trinidad:pom:1.0.1-incubating-SNAPSHOT
from the repository.
[INFO] ----------------------------------------------------------------------------
[INFO] Building Apache Trinidad Build
[INFO]    task-segment: [clean, install]
[INFO] ----------------------------------------------------------------------------
[DEBUG] maven-clean-plugin: resolved to version 2.1 from repository central
[DEBUG] Retrieving parent-POM: org.apache.maven.plugins:maven-plugin-parent::2.0 for project:
null:maven-clean-plugin:maven-plugin:2.1 from the repository.
[DEBUG] Skipping disabled repository central
[DEBUG] Skipping disabled repository java-net
[INFO] snapshot org.apache.myfaces.trinidadbuild:maven-faces-plugin:1.0.1-incubating-SNAPSHOT:
checking for updates from apache.snapshots
[DEBUG] repository metadata for: 'snapshot org.apache.myfaces.trinidadbuild:maven-faces-plugin:1.0.1-incubating-SNAPSHOT'
could not be found on repository: apache.snapshots
[DEBUG] Skipping disabled repository central
[DEBUG] maven-faces-plugin: using locally installed snapshot
[DEBUG] Skipping disabled repository central
[DEBUG] Skipping disabled repository java-net
[DEBUG] Trying repository apache.snapshots
Downloading: http://people.apache.org/repo/m2-snapshot-repository/org/apache/myfaces/trinidadbuild/maven-faces-plugin/1.0.1-incubating-SNAPSHOT/maven-faces-plugin-1.0.1-incubating-SNAPSHOT.pom
[WARNING] Unable to get resource from repository apache.snapshots (http://people.apache.org/repo/m2-snapshot-repository)
[DEBUG] Skipping disabled repository central
[INFO] ------------------------------------------------------------------------
[ERROR] BUILD ERROR
[INFO] ------------------------------------------------------------------------
[INFO] Failed to resolve artifact.

GroupId: org.apache.myfaces.trinidadbuild
ArtifactId: maven-faces-plugin
Version: 1.0.1-incubating-SNAPSHOT

Reason: Unable to download the artifact from any repository

  org.apache.myfaces.trinidadbuild:maven-faces-plugin:pom:1.0.1-incubating-SNAPSHOT

from the specified remote repositories:
  central (http://repo1.maven.org/maven2),
  apache.snapshots (http://people.apache.org/repo/m2-snapshot-repository),
  java-net (https://maven-repository.dev.java.net/nonav/repository/)


[INFO] ------------------------------------------------------------------------
[DEBUG] Trace
org.apache.maven.lifecycle.LifecycleExecutionException: Unable to build project for plugin
'org.apache.myfaces.trinidadbuild:maven-faces-plugin': POM 'org.apache.myfaces.trinidadbuild:maven-faces-plugin'
not found in repository: Unable to download the artifact from any repository

  org.apache.myfaces.trinidadbuild:maven-faces-plugin:pom:1.0.1-incubating-SNAPSHOT

from the specified remote repositories:
  central (http://repo1.maven.org/maven2),
  apache.snapshots (http://people.apache.org/repo/m2-snapshot-repository),
  java-net (https://maven-repository.dev.java.net/nonav/repository/)

	at org.apache.maven.lifecycle.DefaultLifecycleExecutor.verifyPlugin(DefaultLifecycleExecutor.java:1269)
	at org.apache.maven.lifecycle.DefaultLifecycleExecutor.bindPluginToLifecycle(DefaultLifecycleExecutor.java:1216)
	at org.apache.maven.lifecycle.DefaultLifecycleExecutor.constructLifecycleMappings(DefaultLifecycleExecutor.java:982)
	at org.apache.maven.lifecycle.DefaultLifecycleExecutor.executeGoal(DefaultLifecycleExecutor.java:453)
	at org.apache.maven.lifecycle.DefaultLifecycleExecutor.executeGoalAndHandleFailures(DefaultLifecycleExecutor.java:306)
	at org.apache.maven.lifecycle.DefaultLifecycleExecutor.executeTaskSegments(DefaultLifecycleExecutor.java:273)
	at org.apache.maven.lifecycle.DefaultLifecycleExecutor.execute(DefaultLifecycleExecutor.java:140)
	at org.apache.maven.DefaultMaven.doExecute(DefaultMaven.java:322)
	at org.apache.maven.DefaultMaven.execute(DefaultMaven.java:115)
	at org.apache.maven.cli.MavenCli.main(MavenCli.java:256)
	at sun.reflect.NativeMethodAccessorImpl.invoke0(Native Method)
	at sun.reflect.NativeMethodAccessorImpl.invoke(NativeMethodAccessorImpl.java:39)
	at sun.reflect.DelegatingMethodAccessorImpl.invoke(DelegatingMethodAccessorImpl.java:25)
	at java.lang.reflect.Method.invoke(Method.java:585)
	at org.codehaus.classworlds.Launcher.launchEnhanced(Launcher.java:315)
	at org.codehaus.classworlds.Launcher.launch(Launcher.java:255)
	at org.codehaus.classworlds.Launcher.mainWithExitCode(Launcher.java:430)
	at org.codehaus.classworlds.Launcher.main(Launcher.java:375)
Caused by: org.apache.maven.plugin.InvalidPluginException: Unable to build project for plugin
'org.apache.myfaces.trinidadbuild:maven-faces-plugin': POM 'org.apache.myfaces.trinidadbuild:maven-faces-plugin'
not found in repository: Unable to download the artifact from any repository

  org.apache.myfaces.trinidadbuild:maven-faces-plugin:pom:1.0.1-incubating-SNAPSHOT

from the specified remote repositories:
  central (http://repo1.maven.org/maven2),
  apache.snapshots (http://people.apache.org/repo/m2-snapshot-repository),
  java-net (https://maven-repository.dev.java.net/nonav/repository/)

	at org.apache.maven.plugin.DefaultPluginManager.checkRequiredMavenVersion(DefaultPluginManager.java:265)
	at org.apache.maven.plugin.DefaultPluginManager.verifyVersionedPlugin(DefaultPluginManager.java:183)
	at org.apache.maven.plugin.DefaultPluginManager.verifyPlugin(DefaultPluginManager.java:163)
	at org.apache.maven.lifecycle.DefaultLifecycleExecutor.verifyPlugin(DefaultLifecycleExecutor.java:1252)
	... 17 more
Caused by: org.apache.maven.project.ProjectBuildingException: POM 'org.apache.myfaces.trinidadbuild:maven-faces-plugin'
not found in repository: Unable to download the artifact from any repository

  org.apache.myfaces.trinidadbuild:maven-faces-plugin:pom:1.0.1-incubating-SNAPSHOT

from the specified remote repositories:
  central (http://repo1.maven.org/maven2),
  apache.snapshots (http://people.apache.org/repo/m2-snapshot-repository),
  java-net (https://maven-repository.dev.java.net/nonav/repository/)

	at org.apache.maven.project.DefaultMavenProjectBuilder.findModelFromRepository(DefaultMavenProjectBuilder.java:513)
	at org.apache.maven.project.DefaultMavenProjectBuilder.buildFromRepository(DefaultMavenProjectBuilder.java:225)
	at org.apache.maven.plugin.DefaultPluginManager.checkRequiredMavenVersion(DefaultPluginManager.java:249)
	... 20 more
Caused by: org.apache.maven.artifact.resolver.ArtifactNotFoundException: Unable to download
the artifact from any repository

  org.apache.myfaces.trinidadbuild:maven-faces-plugin:pom:1.0.1-incubating-SNAPSHOT

from the specified remote repositories:
  central (http://repo1.maven.org/maven2),
  apache.snapshots (http://people.apache.org/repo/m2-snapshot-repository),
  java-net (https://maven-repository.dev.java.net/nonav/repository/)

	at org.apache.maven.artifact.resolver.DefaultArtifactResolver.resolve(DefaultArtifactResolver.java:136)
	at org.apache.maven.artifact.resolver.DefaultArtifactResolver.resolve(DefaultArtifactResolver.java:63)
	at org.apache.maven.project.DefaultMavenProjectBuilder.findModelFromRepository(DefaultMavenProjectBuilder.java:467)
	... 22 more
Caused by: org.apache.maven.wagon.ResourceDoesNotExistException: Unable to download the artifact
from any repository
	at org.apache.maven.artifact.manager.DefaultWagonManager.getArtifact(DefaultWagonManager.java:260)
	at org.apache.maven.artifact.resolver.DefaultArtifactResolver.resolve(DefaultArtifactResolver.java:124)
	... 24 more
[INFO] ------------------------------------------------------------------------
[INFO] Total time: 1 second
[INFO] Finished at: Tue Feb 27 17:02:44 GMT+00:00 2007
[INFO] Final Memory: 2M/15M
[INFO] ------------------------------------------------------------------------

****************************************************************************



Mime
View raw message