incubator-adffaces-commits mailing list archives

Site index · List index
Message view « Date » · « Thread »
Top « Date » · « Thread »
From "Continuum@myfaces.zones.apache.org" <mrma...@myfaces.zones.apache.org>
Subject [continuum] BUILD FAILURE: Apache Trinidad Impl
Date Fri, 13 Oct 2006 20:13:45 GMT
Online report : http://myfaces.zones.apache.org:8080/continuum/servlet/continuum/target/ProjectBuild.vm/view/ProjectBuild/id/149/buildId/5231
Build statistics:
  State: Failed
  Previous State: Failed
  Started at: Fri, 13 Oct 2006 20:10:19 +0000
  Finished at: Fri, 13 Oct 2006 20:13:45 +0000
  Total time: 3m 25s
  Build Trigger: Schedule
  Exit code: 1
  Building machine hostname: myfaces.zones.apache.org
  Operating system : SunOS(unknown)
  Java version : 1.5.0_07(Sun Microsystems Inc.)

Changes
         awiner          Faces-major version of shuttle.  Phew.
Changes include:
 - More legit set of skinning keys
 - All of the JS associated with the Shuttle is properly taken out of the global namespace


Work to do:
 - Delete all the unnecessary old code
 - Improve the default look of the shuttle with some decent minimal skinning
 - Some skinning fixes
 - Support client-side required validation again
             /incubator/adffaces/trunk/trinidad/trinidad-api/src/main/java/org/apache/myfaces/trinidad/render/CoreRenderer.java
            /incubator/adffaces/trunk/trinidad/trinidad-build/src/main/resources/META-INF/maven-faces-plugin/renderers/trinidad/SelectManyShuttle.xml
            /incubator/adffaces/trunk/trinidad/trinidad-build/src/main/resources/META-INF/maven-faces-plugin/renderers/trinidad/SelectOrderShuttle.xml
            /incubator/adffaces/trunk/trinidad/trinidad-demo/src/main/webapp/components/selectManyShuttle.jspx
            /incubator/adffaces/trunk/trinidad/trinidad-demo/src/main/webapp/components/selectOrderShuttle.jspx
            /incubator/adffaces/trunk/trinidad/trinidad-impl/src/main/java/org/apache/myfaces/trinidadinternal/renderkit/core/xhtml/FormInputRenderer.java
            /incubator/adffaces/trunk/trinidad/trinidad-impl/src/main/java/org/apache/myfaces/trinidadinternal/renderkit/core/xhtml/PanelBoxRenderer.java
            /incubator/adffaces/trunk/trinidad/trinidad-impl/src/main/java/org/apache/myfaces/trinidadinternal/renderkit/core/xhtml/SelectManyShuttleRenderer.java
            /incubator/adffaces/trunk/trinidad/trinidad-impl/src/main/java/org/apache/myfaces/trinidadinternal/renderkit/core/xhtml/SelectOrderShuttleRenderer.java
            /incubator/adffaces/trunk/trinidad/trinidad-impl/src/main/java/org/apache/myfaces/trinidadinternal/renderkit/core/xhtml/SimpleSelectManyListboxRenderer.java
            /incubator/adffaces/trunk/trinidad/trinidad-impl/src/main/java/org/apache/myfaces/trinidadinternal/renderkit/core/xhtml/SimpleSelectManyRenderer.java
            /incubator/adffaces/trunk/trinidad/trinidad-impl/src/main/java/org/apache/myfaces/trinidadinternal/renderkit/core/xhtml/SkinSelectors.java
            /incubator/adffaces/trunk/trinidad/trinidad-impl/src/main/javascript/META-INF/adf/jsLibs/Shuttle.js
            /incubator/adffaces/trunk/trinidad/trinidad-impl/src/test/resources/org/apache/myfaces/trinidadinternal/renderkit/golden/selectManyShuttle-minimal-golden.xml
            /incubator/adffaces/trunk/trinidad/trinidad-impl/src/test/resources/org/apache/myfaces/trinidadinternal/renderkit/golden/selectManyShuttle-minimalIE-golden.xml
            /incubator/adffaces/trunk/trinidad/trinidad-impl/src/test/resources/org/apache/myfaces/trinidadinternal/renderkit/golden/selectManyShuttle-minimalIERtl-golden.xml
            /incubator/adffaces/trunk/trinidad/trinidad-impl/src/test/resources/org/apache/myfaces/trinidadinternal/renderkit/golden/selectManyShuttle-minimalInacc-golden.xml
            /incubator/adffaces/trunk/trinidad/trinidad-impl/src/test/resources/org/apache/myfaces/trinidadinternal/renderkit/golden/selectManyShuttle-minimalSaf-golden.xml
            /incubator/adffaces/trunk/trinidad/trinidad-impl/src/test/resources/org/apache/myfaces/trinidadinternal/renderkit/golden/selectManyShuttle-minimalScrRdr-golden.xml
            /incubator/adffaces/trunk/trinidad/trinidad-impl/src/test/resources/org/apache/myfaces/trinidadinternal/renderkit/golden/selectOrderShuttle-minimal-golden.xml
            /incubator/adffaces/trunk/trinidad/trinidad-impl/src/test/resources/org/apache/myfaces/trinidadinternal/renderkit/golden/selectOrderShuttle-minimalIE-golden.xml
            /incubator/adffaces/trunk/trinidad/trinidad-impl/src/test/resources/org/apache/myfaces/trinidadinternal/renderkit/golden/selectOrderShuttle-minimalIERtl-golden.xml
            /incubator/adffaces/trunk/trinidad/trinidad-impl/src/test/resources/org/apache/myfaces/trinidadinternal/renderkit/golden/selectOrderShuttle-minimalInacc-golden.xml
            /incubator/adffaces/trunk/trinidad/trinidad-impl/src/test/resources/org/apache/myfaces/trinidadinternal/renderkit/golden/selectOrderShuttle-minimalSaf-golden.xml
            /incubator/adffaces/trunk/trinidad/trinidad-impl/src/test/resources/org/apache/myfaces/trinidadinternal/renderkit/golden/selectOrderShuttle-minimalScrRdr-golden.xml
            /incubator/adffaces/trunk/trinidad/trinidad-impl/src/test/resources/org/apache/myfaces/trinidadinternal/renderkit/testScripts/selectManyShuttle.xml
        
****************************************************************************
Output:
****************************************************************************
[INFO] Scanning for projects...
[INFO] Searching repository for plugin with prefix: 'source'.
[INFO] ----------------------------------------------------------------------------
[INFO] Building Apache Trinidad Impl
[INFO]    task-segment: [clean, install, source:jar, deploy]
[INFO] ----------------------------------------------------------------------------
[INFO] snapshot org.apache.myfaces.trinidadbuild:maven-javascript-plugin:incubator-m1-SNAPSHOT:
checking for updates from apache.snapshots
[INFO] [clean:clean]
[INFO] Deleting directory /local/continuum-1.0.3-SNAPSHOT/apps/continuum/working-directory/149/target
[INFO] Deleting directory /local/continuum-1.0.3-SNAPSHOT/apps/continuum/working-directory/149/target/classes
[INFO] Deleting directory /local/continuum-1.0.3-SNAPSHOT/apps/continuum/working-directory/149/target/test-classes
[INFO] snapshot org.apache.myfaces.trinidad:trinidad-api:incubator-m1-SNAPSHOT: checking for
updates from apache.snapshots
[INFO] [faces:generate-jsp-taglibs {execution: default}]
[INFO] Generated 137 JSP tag(s)
[INFO] [faces:generate-facelets-taglibs {execution: default}]
[INFO] Generated META-INF/tr.taglib.xml
[INFO] Generated META-INF/trh.taglib.xml
[INFO] [i18n:generate-locale-elements {execution: default}]
[INFO] Generating LocaleElements
[INFO] [i18n:generate-javascript-locales {execution: default}]
[INFO] Generating Javascript Locales
[INFO] [javascript:reduce-javascript {execution: default}]
[INFO] [xrts:generate-sources {execution: default}]
[INFO] Generating 32 XRTS bundles to /local/continuum-1.0.3-SNAPSHOT/apps/continuum/working-directory/149/target/maven-xrts-plugin/main/java
[INFO] [faces:generate-faces-config {execution: default}]
[INFO] Generated META-INF/faces-config.xml
[INFO] [resources:resources]
[INFO] Using default encoding to copy filtered resources.
[INFO] [compiler:compile]
Compiling 1092 source files to /local/continuum-1.0.3-SNAPSHOT/apps/continuum/working-directory/149/target/classes
[WARNING] /local/continuum-1.0.3-SNAPSHOT/apps/continuum/working-directory/149/src/main/java/org/apache/myfaces/trinidadinternal/facelets/TrinidadListenersTagRule.java:[26,27]
[deprecation] com.sun.facelets.el.LegacyMethodBinding in com.sun.facelets.el has been deprecated

[WARNING] /local/continuum-1.0.3-SNAPSHOT/apps/continuum/working-directory/149/src/main/java/org/apache/myfaces/trinidadinternal/facelets/ReturnActionListenerTag.java:[30,27]
[deprecation] com.sun.facelets.el.LegacyValueBinding in com.sun.facelets.el has been deprecated

[WARNING] /local/continuum-1.0.3-SNAPSHOT/apps/continuum/working-directory/149/src/main/java/org/apache/myfaces/trinidadinternal/facelets/SetActionListenerTag.java:[27,27]
[deprecation] com.sun.facelets.el.LegacyValueBinding in com.sun.facelets.el has been deprecated

[WARNING] /local/continuum-1.0.3-SNAPSHOT/apps/continuum/working-directory/149/src/main/java/org/apache/myfaces/trinidadinternal/ui/laf/base/xhtml/StyledTextRenderer.java:[281,51]
[deprecation] DESCRIPTION_ATTR in org.apache.myfaces.trinidadinternal.ui.UIConstants has been
deprecated

[WARNING] /local/continuum-1.0.3-SNAPSHOT/apps/continuum/working-directory/149/src/main/java/org/apache/myfaces/trinidadinternal/ui/laf/xml/parse/RendererNodeParser.java:[54,39]
[deprecation] create(org.apache.myfaces.trinidadinternal.share.xml.ParseContext,java.lang.String,java.lang.String)
in org.apache.myfaces.trinidadinternal.share.xml.NamespaceURI has been deprecated

[WARNING] /local/continuum-1.0.3-SNAPSHOT/apps/continuum/working-directory/149/src/main/java/org/apache/myfaces/trinidadinternal/share/util/CaboHttpUtils.java:[79,10]
[deprecation] getBytes(int,int,byte[],int) in java.lang.String has been deprecated

[WARNING] /local/continuum-1.0.3-SNAPSHOT/apps/continuum/working-directory/149/src/main/java/org/apache/myfaces/trinidadinternal/share/io/ServletNameResolver.java:[67,30]
[deprecation] getRealPath(java.lang.String) in javax.servlet.ServletRequest has been deprecated

[WARNING] /local/continuum-1.0.3-SNAPSHOT/apps/continuum/working-directory/149/src/main/java/org/apache/myfaces/trinidadinternal/share/nls/MutableLocaleContext.java:[107,14]
[deprecation] setReadingDirection(int) in org.apache.myfaces.trinidadinternal.share.nls.LocaleContextImpl
has been deprecated

[WARNING] /local/continuum-1.0.3-SNAPSHOT/apps/continuum/working-directory/149/src/main/java/org/apache/myfaces/trinidadinternal/share/nls/MutableLocaleContext.java:[111,9]
[deprecation] setReadingDirection(int) in org.apache.myfaces.trinidadinternal.share.nls.LocaleContextImpl
has been deprecated

[WARNING] /local/continuum-1.0.3-SNAPSHOT/apps/continuum/working-directory/149/src/main/java/org/apache/myfaces/trinidadinternal/share/nls/MutableLocaleContext.java:[119,14]
[deprecation] setTimeZone(java.util.TimeZone) in org.apache.myfaces.trinidadinternal.share.nls.LocaleContextImpl
has been deprecated

[WARNING] /local/continuum-1.0.3-SNAPSHOT/apps/continuum/working-directory/149/src/main/java/org/apache/myfaces/trinidadinternal/share/nls/MutableLocaleContext.java:[123,9]
[deprecation] setTimeZone(java.util.TimeZone) in org.apache.myfaces.trinidadinternal.share.nls.LocaleContextImpl
has been deprecated

[WARNING] /local/continuum-1.0.3-SNAPSHOT/apps/continuum/working-directory/149/src/main/java/org/apache/myfaces/trinidadinternal/renderkit/RenderUtils.java:[29,7]
[dep-ann] deprecated name isnt annotated with @Deprecated

[WARNING] /local/continuum-1.0.3-SNAPSHOT/apps/continuum/working-directory/149/src/main/java/org/apache/myfaces/trinidadinternal/application/StateManagerImpl.java:[842,57]
[unchecked] unchecked cast
found   : java.util.List
required: java.util.List<javax.faces.component.UIComponent>

[WARNING] /local/continuum-1.0.3-SNAPSHOT/apps/continuum/working-directory/149/src/main/java/org/apache/myfaces/trinidadinternal/application/StateManagerImpl.java:[843,36]
[unchecked] unchecked call to addAll(java.util.Collection<? extends E>) as a member
of the raw type java.util.List

[INFO] [xrts:generate-test-sources {execution: default}]
[INFO] [resources:testResources]
[INFO] Using default encoding to copy filtered resources.
[INFO] [compiler:testCompile]
Compiling 42 source files to /local/continuum-1.0.3-SNAPSHOT/apps/continuum/working-directory/149/target/test-classes
[WARNING] /local/continuum-1.0.3-SNAPSHOT/apps/continuum/working-directory/149/src/test/java/org/apache/myfaces/trinidadinternal/context/RequestContextTest.java:[98,28]
[unchecked] unchecked call to add(E) as a member of the raw type java.util.List

[WARNING] /local/continuum-1.0.3-SNAPSHOT/apps/continuum/working-directory/149/src/test/java/org/apache/myfaces/trinidadinternal/context/RequestContextTest.java:[99,28]
[unchecked] unchecked call to add(E) as a member of the raw type java.util.List

[WARNING] /local/continuum-1.0.3-SNAPSHOT/apps/continuum/working-directory/149/src/test/java/org/apache/myfaces/trinidadinternal/renderkit/RenderKitTestCase.java:[177,6]
[deprecation] org.apache.myfaces.trinidadinternal.renderkit.RenderUtils in org.apache.myfaces.trinidadinternal.renderkit
has been deprecated

[WARNING] /local/continuum-1.0.3-SNAPSHOT/apps/continuum/working-directory/149/src/test/java/org/apache/myfaces/trinidadinternal/renderkit/MVariableResolver.java:[220,13]
[deprecation] Date(int,int,int) in java.util.Date has been deprecated

[WARNING] /local/continuum-1.0.3-SNAPSHOT/apps/continuum/working-directory/149/src/test/java/org/apache/myfaces/trinidadinternal/renderkit/MVariableResolver.java:[225,13]
[deprecation] Date(int,int,int) in java.util.Date has been deprecated

[WARNING] /local/continuum-1.0.3-SNAPSHOT/apps/continuum/working-directory/149/src/test/java/org/apache/myfaces/trinidadinternal/renderkit/MVariableResolver.java:[230,13]
[deprecation] Date(int,int,int) in java.util.Date has been deprecated

[WARNING] /local/continuum-1.0.3-SNAPSHOT/apps/continuum/working-directory/149/src/test/java/org/apache/myfaces/trinidadinternal/renderkit/RenderKitPerfTestCase.java:[64,6]
[deprecation] org.apache.myfaces.trinidadinternal.renderkit.RenderUtils in org.apache.myfaces.trinidadinternal.renderkit
has been deprecated

[WARNING] /local/continuum-1.0.3-SNAPSHOT/apps/continuum/working-directory/149/src/test/java/org/apache/myfaces/trinidadinternal/renderkit/RenderKitPerfTestCase.java:[190,8]
[deprecation] org.apache.myfaces.trinidadinternal.renderkit.RenderUtils in org.apache.myfaces.trinidadinternal.renderkit
has been deprecated

[INFO] [surefire:test]
[INFO] Setting reports dir: /local/continuum-1.0.3-SNAPSHOT/apps/continuum/working-directory/149/target/surefire-reports

-------------------------------------------------------
 T E S T S
-------------------------------------------------------
Oct 13, 2006 8:13:14 PM org.apache.myfaces.trinidadinternal.renderkit.FacesConfigInfo load
INFO: PARSING file:/local/continuum-1.0.3-SNAPSHOT/apps/continuum/working-directory/149/target/classes/META-INF/faces-config.xml
Oct 13, 2006 8:13:15 PM org.apache.myfaces.trinidadinternal.renderkit.RenderKitBase getRenderer
WARNING: Renderer 'javax.faces.Table' not found for component family 'javax.faces.Data'
Oct 13, 2006 8:13:15 PM org.apache.myfaces.trinidadinternal.renderkit.core.CoreRenderKit _addBasicHTMLRenderKit
WARNING: Could not find basic HTML renderer for family javax.faces.Data, type=javax.faces.Table
Oct 13, 2006 8:13:15 PM org.apache.myfaces.trinidadinternal.renderkit.RenderKitBase getRenderer
WARNING: Renderer 'javax.faces.Text' not found for component family 'javax.faces.Input'
Oct 13, 2006 8:13:15 PM org.apache.myfaces.trinidadinternal.renderkit.core.CoreRenderKit _addBasicHTMLRenderKit
WARNING: Could not find basic HTML renderer for family javax.faces.Input, type=javax.faces.Text
Oct 13, 2006 8:13:15 PM org.apache.myfaces.trinidadinternal.renderkit.RenderKitBase getRenderer
WARNING: Renderer 'javax.faces.Text' not found for component family 'javax.faces.Output'
Oct 13, 2006 8:13:15 PM org.apache.myfaces.trinidadinternal.renderkit.core.CoreRenderKit _addBasicHTMLRenderKit
WARNING: Could not find basic HTML renderer for family javax.faces.Output, type=javax.faces.Text
Oct 13, 2006 8:13:15 PM org.apache.myfaces.trinidadinternal.renderkit.RenderKitBase getRenderer
WARNING: Renderer 'javax.faces.Menu' not found for component family 'javax.faces.SelectOne'
Oct 13, 2006 8:13:15 PM org.apache.myfaces.trinidadinternal.renderkit.core.CoreRenderKit _addBasicHTMLRenderKit
WARNING: Could not find basic HTML renderer for family javax.faces.SelectOne, type=javax.faces.Menu
Oct 13, 2006 8:13:15 PM org.apache.myfaces.trinidadinternal.renderkit.RenderKitBase getRenderer
WARNING: Renderer 'javax.faces.Radio' not found for component family 'javax.faces.SelectOne'
Oct 13, 2006 8:13:15 PM org.apache.myfaces.trinidadinternal.renderkit.core.CoreRenderKit _addBasicHTMLRenderKit
WARNING: Could not find basic HTML renderer for family javax.faces.SelectOne, type=javax.faces.Radio
Oct 13, 2006 8:13:16 PM org.apache.myfaces.trinidadinternal.renderkit.FacesConfigInfo load
INFO: PARSING jar:file:/export/home/mrmaven/.m2/repository/com/sun/facelets/jsf-facelets/1.1.6/jsf-facelets-1.1.6.jar!/META-INF/faces-config.xml
Couldn't create renderer com.sun.facelets.component.RepeatRenderer
[surefire] Running org.apache.myfaces.trinidadinternal.metadata.RegionMetadataTest
[surefire] Tests run: 1, Failures: 0, Errors: 0, Time elapsed: 0.248 sec
[surefire] Running org.apache.myfaces.trinidadinternal.renderkit.core.xhtml.table.TableSelectOneRendererTest
[surefire] Tests run: 2, Failures: 0, Errors: 0, Time elapsed: 0.046 sec
[surefire] Running org.apache.myfaces.trinidadinternal.renderkit.CoreRenderKitTest
[surefire] Tests run: 768, Failures: 12, Errors: 0, Time elapsed: 25.862 sec <<<<<<<<
FAILURE !! 
[surefire] Running org.apache.myfaces.trinidadinternal.context.RequestContextTest
[surefire] Tests run: 3, Failures: 0, Errors: 0, Time elapsed: 0.054 sec
[surefire] Running org.apache.myfaces.trinidadinternal.application.ViewHandlerImplTest
[surefire] Tests run: 1, Failures: 0, Errors: 0, Time elapsed: 0.009 sec
[surefire] Running org.apache.myfaces.trinidadinternal.validator.ByteLengthValidatorTest
[surefire] Tests run: 1, Failures: 0, Errors: 0, Time elapsed: 0.095 sec
[surefire] Running org.apache.myfaces.trinidadinternal.el.FormatterMapTest
[surefire] Tests run: 1, Failures: 0, Errors: 0, Time elapsed: 0.004 sec
[surefire] Running org.apache.myfaces.trinidadinternal.el.TokenizerTest
[surefire] Tests run: 7, Failures: 0, Errors: 0, Time elapsed: 0.006 sec
[surefire] Running org.apache.myfaces.trinidadinternal.FacesConfigTest
[surefire] Tests run: 1, Failures: 0, Errors: 0, Time elapsed: 0.002 sec
[surefire] Running org.apache.myfaces.trinidadinternal.util.SubKeyMapTest
[surefire] Tests run: 10, Failures: 0, Errors: 0, Time elapsed: 0.012 sec
[surefire] Running org.apache.myfaces.trinidadinternal.taglib.TLDTest
[surefire] Tests run: 2, Failures: 0, Errors: 0, Time elapsed: 0.172 sec
[surefire] Running org.apache.myfaces.trinidadinternal.ui.laf.base.xhtml.XhtmlLafUtilsTest
[surefire] Tests run: 2, Failures: 0, Errors: 0, Time elapsed: 0.007 sec
[surefire] Running org.apache.myfaces.trinidad.resource.MessageBundleTest
Oct 13, 2006 8:13:44 PM org.apache.myfaces.trinidad.resource.MessageBundleTest _validateBundleLocale
WARNING: Expected bundle not loaded:
 Loaded bundle is MessageBundle_en
 Expected bundle is MessageBundle_ca

Oct 13, 2006 8:13:44 PM org.apache.myfaces.trinidad.resource.MessageBundleTest _validateBundleLocale
WARNING: Expected bundle not loaded:
 Loaded bundle is MessageBundle_en
 Expected bundle is MessageBundle_hr

Oct 13, 2006 8:13:44 PM org.apache.myfaces.trinidad.resource.MessageBundleTest _validateBundleLocale
WARNING: Expected bundle not loaded:
 Loaded bundle is MessageBundle_en
 Expected bundle is MessageBundle_is

[surefire] Tests run: 1, Failures: 0, Errors: 0, Time elapsed: 0.107 sec
[INFO] ------------------------------------------------------------------------
[ERROR] BUILD ERROR
[INFO] ------------------------------------------------------------------------
[INFO] There are test failures.
[INFO] ------------------------------------------------------------------------
[INFO] For more information, run Maven with the -e switch
[INFO] ------------------------------------------------------------------------
[INFO] Total time: 3 minutes 21 seconds
[INFO] Finished at: Fri Oct 13 20:13:44 GMT+00:00 2006
[INFO] Final Memory: 27M/332M
[INFO] ------------------------------------------------------------------------

****************************************************************************



Mime
View raw message