incubator-adffaces-commits mailing list archives

Site index · List index
Message view « Date » · « Thread »
Top « Date » · « Thread »
From "Continuum@myfaces.zones.apache.org" <mrma...@myfaces.zones.apache.org>
Subject [continuum] BUILD FAILURE: Apache Trinidad Impl
Date Mon, 09 Oct 2006 19:12:43 GMT
Online report : http://myfaces.zones.apache.org:8080/continuum/servlet/continuum/target/ProjectBuild.vm/view/ProjectBuild/id/149/buildId/4979
Build statistics:
  State: Failed
  Previous State: Failed
  Started at: Mon, 9 Oct 2006 19:09:58 +0000
  Finished at: Mon, 9 Oct 2006 19:12:43 +0000
  Total time: 2m 44s
  Build Trigger: Schedule
  Exit code: 1
  Building machine hostname: myfaces.zones.apache.org
  Operating system : SunOS(unknown)
  Java version : 1.5.0_07(Sun Microsystems Inc.)

Changes
         matzew          issue 106, thx. to Gabrielle Crawford
             /incubator/adffaces/trunk/trinidad/trinidad-impl/src/main/java/org/apache/myfaces/trinidadinternal/resource/CoreRenderKitResourceLoader.java
            /incubator/adffaces/trunk/trinidad/trinidad-impl/src/main/java/org/apache/myfaces/trinidadinternal/resource/LocaleElementsResourceLoader.java
            /incubator/adffaces/trunk/trinidad/trinidad-impl/src/main/java/org/apache/myfaces/trinidadinternal/resource/TrTranslationsResourceLoader.java
            /incubator/adffaces/trunk/trinidad/trinidad-impl/src/main/javascript/META-INF/adf/jsLibs/Locale.js
        
****************************************************************************
Output:
****************************************************************************
[INFO] Scanning for projects...
[INFO] Searching repository for plugin with prefix: 'source'.
[INFO] ----------------------------------------------------------------------------
[INFO] Building Apache Trinidad Impl
[INFO]    task-segment: [clean, install, source:jar, deploy]
[INFO] ----------------------------------------------------------------------------
[INFO] snapshot org.apache.myfaces.trinidadbuild:maven-faces-plugin:incubator-m1-SNAPSHOT:
checking for updates from apache.snapshots
[INFO] snapshot org.apache.myfaces.trinidadbuild:maven-i18n-plugin:incubator-m1-SNAPSHOT:
checking for updates from apache.snapshots
[INFO] snapshot org.apache.myfaces.trinidadbuild:maven-javascript-plugin:incubator-m1-SNAPSHOT:
checking for updates from apache.snapshots
[INFO] snapshot org.apache.myfaces.trinidadbuild:maven-xrts-plugin:incubator-m1-SNAPSHOT:
checking for updates from apache.snapshots
[INFO] [clean:clean]
[INFO] Deleting directory /local/continuum-1.0.3-SNAPSHOT/apps/continuum/working-directory/149/target
[INFO] Deleting directory /local/continuum-1.0.3-SNAPSHOT/apps/continuum/working-directory/149/target/classes
[INFO] Deleting directory /local/continuum-1.0.3-SNAPSHOT/apps/continuum/working-directory/149/target/test-classes
[INFO] snapshot org.apache.myfaces.trinidad:trinidad-api:incubator-m1-SNAPSHOT: checking for
updates from apache.snapshots
[INFO] snapshot org.apache.myfaces.trinidad:trinidad-build:incubator-m1-SNAPSHOT: checking
for updates from apache.snapshots
[INFO] [faces:generate-jsp-taglibs {execution: default}]
[INFO] Generated 137 JSP tag(s)
[INFO] [faces:generate-facelets-taglibs {execution: default}]
[INFO] Generated META-INF/tr.taglib.xml
[INFO] Generated META-INF/trh.taglib.xml
[INFO] [i18n:generate-locale-elements {execution: default}]
[INFO] Generating LocaleElements
[INFO] [i18n:generate-javascript-locales {execution: default}]
[INFO] Generating Javascript Locales
[INFO] [javascript:reduce-javascript {execution: default}]
[INFO] [xrts:generate-sources {execution: default}]
[INFO] Generating 32 XRTS bundles to /local/continuum-1.0.3-SNAPSHOT/apps/continuum/working-directory/149/target/maven-xrts-plugin/main/java
[INFO] [faces:generate-faces-config {execution: default}]
[INFO] Generated META-INF/faces-config.xml
[INFO] [resources:resources]
[INFO] Using default encoding to copy filtered resources.
[INFO] [compiler:compile]
Compiling 1087 source files to /local/continuum-1.0.3-SNAPSHOT/apps/continuum/working-directory/149/target/classes
[INFO] ------------------------------------------------------------------------
[ERROR] BUILD FAILURE
[INFO] ------------------------------------------------------------------------
[INFO] Compilation failure

/local/continuum-1.0.3-SNAPSHOT/apps/continuum/working-directory/149/src/main/java/org/apache/myfaces/trinidadinternal/facelets/TrinidadListenersTagRule.java:[26,27]
[deprecation] com.sun.facelets.el.LegacyMethodBinding in com.sun.facelets.el has been deprecated

/local/continuum-1.0.3-SNAPSHOT/apps/continuum/working-directory/149/src/main/java/org/apache/myfaces/trinidadinternal/facelets/ReturnActionListenerTag.java:[30,27]
[deprecation] com.sun.facelets.el.LegacyValueBinding in com.sun.facelets.el has been deprecated

/local/continuum-1.0.3-SNAPSHOT/apps/continuum/working-directory/149/src/main/java/org/apache/myfaces/trinidadinternal/facelets/SetActionListenerTag.java:[27,27]
[deprecation] com.sun.facelets.el.LegacyValueBinding in com.sun.facelets.el has been deprecated

/local/continuum-1.0.3-SNAPSHOT/apps/continuum/working-directory/149/src/main/java/org/apache/myfaces/trinidadinternal/ui/laf/base/xhtml/StyledTextRenderer.java:[281,51]
[deprecation] DESCRIPTION_ATTR in org.apache.myfaces.trinidadinternal.ui.UIConstants has been
deprecated

/local/continuum-1.0.3-SNAPSHOT/apps/continuum/working-directory/149/src/main/java/org/apache/myfaces/trinidadinternal/ui/laf/xml/parse/RendererNodeParser.java:[54,39]
[deprecation] create(org.apache.myfaces.trinidadinternal.share.xml.ParseContext,java.lang.String,java.lang.String)
in org.apache.myfaces.trinidadinternal.share.xml.NamespaceURI has been deprecated

/local/continuum-1.0.3-SNAPSHOT/apps/continuum/working-directory/149/src/main/java/org/apache/myfaces/trinidadinternal/resource/TrTranslationsResourceLoader.java:[133,48]
non-varargs call of varargs method with inexact argument type for last parameter;
cast to java.lang.Class for a varargs call
cast to java.lang.Class[] for a non-varargs call and to suppress this warning

/local/continuum-1.0.3-SNAPSHOT/apps/continuum/working-directory/149/src/main/java/org/apache/myfaces/trinidadinternal/resource/TrTranslationsResourceLoader.java:[134,42]
non-varargs call of varargs method with inexact argument type for last parameter;
cast to java.lang.Object for a varargs call
cast to java.lang.Object[] for a non-varargs call and to suppress this warning

/local/continuum-1.0.3-SNAPSHOT/apps/continuum/working-directory/149/src/main/java/org/apache/myfaces/trinidadinternal/share/util/CaboHttpUtils.java:[79,10]
[deprecation] getBytes(int,int,byte[],int) in java.lang.String has been deprecated

/local/continuum-1.0.3-SNAPSHOT/apps/continuum/working-directory/149/src/main/java/org/apache/myfaces/trinidadinternal/share/io/ServletNameResolver.java:[67,30]
[deprecation] getRealPath(java.lang.String) in javax.servlet.ServletRequest has been deprecated

/local/continuum-1.0.3-SNAPSHOT/apps/continuum/working-directory/149/src/main/java/org/apache/myfaces/trinidadinternal/share/nls/MutableLocaleContext.java:[107,14]
[deprecation] setReadingDirection(int) in org.apache.myfaces.trinidadinternal.share.nls.LocaleContextImpl
has been deprecated

/local/continuum-1.0.3-SNAPSHOT/apps/continuum/working-directory/149/src/main/java/org/apache/myfaces/trinidadinternal/share/nls/MutableLocaleContext.java:[111,9]
[deprecation] setReadingDirection(int) in org.apache.myfaces.trinidadinternal.share.nls.LocaleContextImpl
has been deprecated

/local/continuum-1.0.3-SNAPSHOT/apps/continuum/working-directory/149/src/main/java/org/apache/myfaces/trinidadinternal/share/nls/MutableLocaleContext.java:[119,14]
[deprecation] setTimeZone(java.util.TimeZone) in org.apache.myfaces.trinidadinternal.share.nls.LocaleContextImpl
has been deprecated

/local/continuum-1.0.3-SNAPSHOT/apps/continuum/working-directory/149/src/main/java/org/apache/myfaces/trinidadinternal/share/nls/MutableLocaleContext.java:[123,9]
[deprecation] setTimeZone(java.util.TimeZone) in org.apache.myfaces.trinidadinternal.share.nls.LocaleContextImpl
has been deprecated

/local/continuum-1.0.3-SNAPSHOT/apps/continuum/working-directory/149/src/main/java/org/apache/myfaces/trinidadinternal/renderkit/RenderUtils.java:[29,7]
[dep-ann] deprecated name isnt annotated with @Deprecated

/local/continuum-1.0.3-SNAPSHOT/apps/continuum/working-directory/149/src/main/java/org/apache/myfaces/trinidadinternal/application/StateManagerImpl.java:[842,36]
[unchecked] unchecked conversion
found   : java.util.List
required: java.util.Collection<? extends javax.faces.component.UIComponent>

/local/continuum-1.0.3-SNAPSHOT/apps/continuum/working-directory/149/src/main/java/org/apache/myfaces/trinidadinternal/application/StateManagerImpl.java:[843,36]
[unchecked] unchecked call to addAll(java.util.Collection<? extends E>) as a member
of the raw type java.util.List

/local/continuum-1.0.3-SNAPSHOT/apps/continuum/working-directory/149/target/maven-faces-plugin/main/java/org/apache/myfaces/trinidadinternal/taglib/core/layout/CorePanelButtonBarTag.java:[148,40]
cannot find symbol
symbol  : variable HALIGN_KEY
location: class org.apache.myfaces.trinidad.component.core.layout.CorePanelButtonBar


[INFO] ------------------------------------------------------------------------
[INFO] For more information, run Maven with the -e switch
[INFO] ------------------------------------------------------------------------
[INFO] Total time: 2 minutes 41 seconds
[INFO] Finished at: Mon Oct 09 19:12:42 GMT+00:00 2006
[INFO] Final Memory: 12M/322M
[INFO] ------------------------------------------------------------------------

****************************************************************************



Mime
View raw message