incubator-adffaces-commits mailing list archives

Site index · List index
Message view « Date » · « Thread »
Top « Date » · « Thread »
From "Continuum@myfaces.zones.apache.org" <mrma...@myfaces.zones.apache.org>
Subject [continuum] BUILD FAILURE: ADF Faces Apache Impl
Date Thu, 20 Jul 2006 07:01:54 GMT
Online report : http://myfaces.zones.apache.org:8080/continuum/servlet/continuum/target/ProjectBuild.vm/view/ProjectBuild/id/94/buildId/2938
Build statistics:
  State: Failed
  Previous State: Ok
  Started at: Thu, 20 Jul 2006 07:01:39 +0000
  Finished at: Thu, 20 Jul 2006 07:01:54 +0000
  Total time: 14s
  Build Trigger: Schedule
  Exit code: 1
  Building machine hostname: myfaces.zones.apache.org
  Operating system : SunOS(unknown)
  Java version : 1.5.0_06(Sun Microsystems Inc.)

Changes
         awiner          ADFFACES-57: Add a new ouputDocument component to print multi-paragraph
text;  mostly from patch by Simon Lessard
             /incubator/adffaces/trunk/adf-faces/adf-faces-build/src/main/resources/META-INF/maven-faces-plugin/components/adf/core/CoreOutputDocument.xml
            /incubator/adffaces/trunk/adf-faces/adf-faces-build/src/main/resources/META-INF/maven-faces-plugin/renderers/adf/OutputDocument.xml
            /incubator/adffaces/trunk/adf-faces/adf-faces-demo/src/main/webapp/WEB-INF/faces-config.xml
            /incubator/adffaces/trunk/adf-faces/adf-faces-demo/src/main/webapp/components/outputDocument.jspx
            /incubator/adffaces/trunk/adf-faces/adf-faces-impl/src/main/java/org/apache/myfaces/adfinternal/renderkit/core/xhtml/OutputDocumentRenderer.java
            /incubator/adffaces/trunk/adf-faces/adf-faces-impl/src/main/java/org/apache/myfaces/adfinternal/renderkit/core/xhtml/XhtmlConstants.java
            /incubator/adffaces/trunk/adf-faces/adf-faces-impl/src/main/resources/META-INF/adf/styles/base-desktop.xss
        
****************************************************************************
Output:
****************************************************************************
[INFO] Scanning for projects...
[INFO] Searching repository for plugin with prefix: 'source'.
[INFO] ----------------------------------------------------------------------------
[INFO] Building ADF Faces Apache Impl
[INFO]    task-segment: [clean, install, source:jar, deploy]
[INFO] ----------------------------------------------------------------------------
[INFO] [clean:clean]
[INFO] Deleting directory /local/continuum-1.0.3-SNAPSHOT/apps/continuum/working-directory/94/target
[INFO] Deleting directory /local/continuum-1.0.3-SNAPSHOT/apps/continuum/working-directory/94/target/classes
[INFO] Deleting directory /local/continuum-1.0.3-SNAPSHOT/apps/continuum/working-directory/94/target/test-classes
Downloading: http://repo1.maven.org/maven2/stax/stax-api/1.0.1/stax-api-1.0.1.pom
[WARNING] Unable to get resource from repository central (http://repo1.maven.org/maven2)
[INFO] [faces:generate-jsp-taglibs {execution: default}]
org.xml.sax.SAXParseException: unexpected character after document prolog (found "v") (expected
"<")
	at com.icl.saxon.aelfred.SAXDriver.error(SAXDriver.java:857)
	at com.icl.saxon.aelfred.XmlParser.error(XmlParser.java:463)
	at com.icl.saxon.aelfred.XmlParser.error(XmlParser.java:478)
	at com.icl.saxon.aelfred.XmlParser.require(XmlParser.java:2614)
	at com.icl.saxon.aelfred.XmlParser.parseDocument(XmlParser.java:509)
	at com.icl.saxon.aelfred.XmlParser.doParse(XmlParser.java:163)
	at com.icl.saxon.aelfred.SAXDriver.parse(SAXDriver.java:320)
	at org.apache.commons.digester.Digester.parse(Digester.java:1666)
	at org.apache.myfaces.adfbuild.plugin.faces.parse.FacesConfigParser.merge(FacesConfigParser.java:61)
	at org.apache.myfaces.adfbuild.plugin.faces.AbstractFacesMojo.processIndexEntry(AbstractFacesMojo.java:247)
	at org.apache.myfaces.adfbuild.plugin.faces.AbstractFacesMojo.processIndex(AbstractFacesMojo.java:237)
	at org.apache.myfaces.adfbuild.plugin.faces.GenerateJspTaglibsMojo.execute(GenerateJspTaglibsMojo.java:90)
	at org.apache.maven.plugin.DefaultPluginManager.executeMojo(DefaultPluginManager.java:412)
	at org.apache.maven.lifecycle.DefaultLifecycleExecutor.executeGoals(DefaultLifecycleExecutor.java:534)
	at org.apache.maven.lifecycle.DefaultLifecycleExecutor.executeGoalWithLifecycle(DefaultLifecycleExecutor.java:475)
	at org.apache.maven.lifecycle.DefaultLifecycleExecutor.executeGoal(DefaultLifecycleExecutor.java:454)
	at org.apache.maven.lifecycle.DefaultLifecycleExecutor.executeGoalAndHandleFailures(DefaultLifecycleExecutor.java:306)
	at org.apache.maven.lifecycle.DefaultLifecycleExecutor.executeTaskSegments(DefaultLifecycleExecutor.java:273)
	at org.apache.maven.lifecycle.DefaultLifecycleExecutor.execute(DefaultLifecycleExecutor.java:140)
	at org.apache.maven.DefaultMaven.doExecute(DefaultMaven.java:322)
	at org.apache.maven.DefaultMaven.execute(DefaultMaven.java:115)
	at org.apache.maven.cli.MavenCli.main(MavenCli.java:256)
	at sun.reflect.NativeMethodAccessorImpl.invoke0(Native Method)
	at sun.reflect.NativeMethodAccessorImpl.invoke(NativeMethodAccessorImpl.java:39)
	at sun.reflect.DelegatingMethodAccessorImpl.invoke(DelegatingMethodAccessorImpl.java:25)
	at java.lang.reflect.Method.invoke(Method.java:585)
	at org.codehaus.classworlds.Launcher.launchEnhanced(Launcher.java:315)
	at org.codehaus.classworlds.Launcher.launch(Launcher.java:255)
	at org.codehaus.classworlds.Launcher.mainWithExitCode(Launcher.java:430)
	at org.codehaus.classworlds.Launcher.main(Launcher.java:375)
[ERROR] Digester - -Parse Fatal Error at line 1 column 5: unexpected character after document
prolog (found "v") (expected "<") <org.xml.sax.SAXParseException: unexpected character
after document prolog (found "v") (expected "<")>
[INFO] ------------------------------------------------------------------------
[ERROR] BUILD ERROR
[INFO] ------------------------------------------------------------------------
[INFO] Failed to parse jar:file:/export/home/mrmaven/.m2/repository/org/apache/myfaces/adf/adf-faces-build/incubator-m1-SNAPSHOT/adf-faces-build-incubator-m1-SNAPSHOT.jar!/META-INF/maven-faces-plugin/components/adf/core/CoreOutputDocument.xml

Embedded error: unexpected character after document prolog (found "v") (expected "<")
[INFO] ------------------------------------------------------------------------
[INFO] For more information, run Maven with the -e switch
[INFO] ------------------------------------------------------------------------
[INFO] Total time: 13 seconds
[INFO] Finished at: Thu Jul 20 07:01:54 GMT+00:00 2006
[INFO] Final Memory: 9M/336M
[INFO] ------------------------------------------------------------------------

****************************************************************************



Mime
View raw message