impala-issues mailing list archives

Site index · List index
Message view « Date » · « Thread »
Top « Date » · « Thread »
From "Thomas Tauber-Marshall (JIRA)" <>
Subject [jira] [Created] (IMPALA-5453) TestCreateTableLikeFile fails on 'enum.parquet'
Date Wed, 07 Jun 2017 21:25:18 GMT
Thomas Tauber-Marshall created IMPALA-5453:

             Summary: TestCreateTableLikeFile fails on 'enum.parquet'
                 Key: IMPALA-5453
             Project: IMPALA
          Issue Type: Bug
    Affects Versions: Impala 2.10.0
            Reporter: Thomas Tauber-Marshall
            Priority: Blocker

Seen in a Jenkins build. I can also repro locally.

Tests run: 45, Failures: 1, Errors: 0, Skipped: 0, Time elapsed: 2.476 sec <<< FAILURE!
- in org.apache.impala.analysis.AnalyzeDDLTest
TestCreateTableLikeFile(org.apache.impala.analysis.AnalyzeDDLTest)  Time elapsed: 0.035 sec
java.lang.AssertionError: Error:
org.apache.impala.common.AnalysisException: Cannot infer schema, path is not a file: hdfs://localhost:20500/test-warehouse/schemas/enum/enum.parquet
	at org.apache.impala.common.FrontendTestBase.AnalyzesOk(
	at org.apache.impala.common.FrontendTestBase.AnalyzesOk(
	at org.apache.impala.analysis.AnalyzeDDLTest.TestCreateTableLikeFile(

Appears to be related to IMPALA-2525, which just went in.

I believe that the problem is a typo in

It should say 'enum.parquet' where it says 'enum'

This message was sent by Atlassian JIRA

View raw message