impala-issues mailing list archives

Site index · List index
Message view « Date » · « Thread »
Top « Date » · « Thread »
From "Thomas Tauber-Marshall (JIRA)" <j...@apache.org>
Subject [jira] [Resolved] (IMPALA-5445) test_parquet fails with missing exception
Date Thu, 08 Jun 2017 15:33:18 GMT

     [ https://issues.apache.org/jira/browse/IMPALA-5445?page=com.atlassian.jira.plugin.system.issuetabpanels:all-tabpanel
]

Thomas Tauber-Marshall resolved IMPALA-5445.
--------------------------------------------
    Resolution: Duplicate

IMPALA-5427

> test_parquet fails with missing exception
> -----------------------------------------
>
>                 Key: IMPALA-5445
>                 URL: https://issues.apache.org/jira/browse/IMPALA-5445
>             Project: IMPALA
>          Issue Type: Bug
>          Components: Backend
>    Affects Versions: Impala 2.10.0
>            Reporter: Thomas Tauber-Marshall
>            Priority: Blocker
>              Labels: broken-build
>
> Seen in an asf-master exhaustive Jenkins build.
> {noformat}
> 04:24:53 =================================== FAILURES ===================================
> 04:24:53  TestParquet.test_parquet[exec_option: {'disable_codegen': True, 'abort_on_error':
1, 'exec_single_node_rows_threshold': 0, 'batch_size': 0, 'num_nodes': 0} | table_format:
parquet/none] 
> 04:24:53 [gw2] linux2 -- Python 2.6.6 /data/jenkins/workspace/impala-umbrella-build-and-test/repos/Impala/bin/../infra/python/env/bin/python
> 04:24:53 query_test/test_scanners.py:252: in test_parquet
> 04:24:53     self.run_test_case('QueryTest/parquet', vector)
> 04:24:53 common/impala_test_suite.py:393: in run_test_case
> 04:24:53     self.__verify_exceptions(test_section['CATCH'], str(e), use_db)
> 04:24:53 common/impala_test_suite.py:272: in __verify_exceptions
> 04:24:53     (expected_str, actual_str)
> 04:24:53 E   AssertionError: Unexpected exception string. Expected: Column 0 has invalid
column offsets (offset=4, size=1000000, file_size=245)
> 04:24:53 E   Not found in actual: ImpalaBeeswaxException: Query aborted:
> 04:24:53 ---------------------------- Captured stderr setup -----------------------------
> 04:24:53 -- connecting to: localhost:21000
> 04:24:53 ----------------------------- Captured stderr call -----------------------------
> 04:24:53 -- executing against localhost:21000
> 04:24:53 use functional_parquet;
> 04:24:53 
> 04:24:53 SET disable_codegen=True;
> 04:24:53 SET abort_on_error=1;
> 04:24:53 SET exec_single_node_rows_threshold=0;
> 04:24:53 SET batch_size=0;
> 04:24:53 SET num_nodes=0;
> 04:24:53 -- executing against localhost:21000
> 04:24:53 SELECT * from bad_parquet where field = "parquet";
> 04:24:53 
> 04:24:53 -- executing against localhost:21000
> 04:24:53 SELECT count(distinct field) from bad_parquet;
> 04:24:53 
> 04:24:53 -- executing against localhost:21000
> 04:24:53 SELECT * from bad_metadata_len;
> 04:24:53 
> 04:24:53 -- executing against localhost:21000
> 04:24:53 SELECT * from bad_dict_page_offset;
> 04:24:53 
> 04:24:53 -- executing against localhost:21000
> 04:24:53 SELECT * from bad_compressed_size;
> 04:24:53 
> 04:24:53 ===== 1 failed, 10949 passed, 139 skipped, 500 xfailed in 14817.76 seconds =====
> {noformat}



--
This message was sent by Atlassian JIRA
(v6.3.15#6346)

Mime
View raw message