ignite-user mailing list archives

Site index · List index
Message view « Date » · « Thread »
Top « Date » · « Thread »
From zshamrock <aliaksandr.kaz...@gmail.com>
Subject Cannot find schema for object with compact footer
Date Sun, 22 Oct 2017 18:05:32 GMT
>From time to time we get the following integration test failure (using mvn
test command). Sometimes it passes without any problems, sometime it fails,
and not necessary the same test. It never fails when running the test
standalone, i.e. from IDEA for example.

Here is the failure:

Tests run: 3, Failures: 0, Errors: 1, Skipped: 0, Time elapsed: 8.418 sec
<<< FAILURE! - in SessionLineupsCacheITSpec
verify get on the existing session id returns the corresponding session
lineups(SessionLineupsCacheITSpec)  Time elapsed: 0.142 sec  <<< ERROR!
javax.cache.CacheException: class org.apache.ignite.IgniteCheckedException:
Cannot find schema for object with compact footer [typeId=709293316,
schemaId=96980434]
	at SessionLineupsCacheITSpec.verify get on the existing session id returns
the corresponding session lineups(SessionLineupsCacheITSpec.groovy:48)
Caused by: org.apache.ignite.IgniteCheckedException: Cannot find schema for
object with compact footer [typeId=709293316, schemaId=96980434]
	at SessionLineupsCacheITSpec.verify get on the existing session id returns
the corresponding session lineups(SessionLineupsCacheITSpec.groovy:48)
Caused by: org.apache.ignite.binary.BinaryObjectException: Cannot find
schema for object with compact footer [typeId=709293316, schemaId=96980434]

What does it mean "Cannot find schema for object with compact footer", and
what could be the cause of this in-consistence behavior, i.e. why it passes
sometimes, and sometimes fails?



--
Sent from: http://apache-ignite-users.70518.x6.nabble.com/

Mime
View raw message