ignite-issues mailing list archives

Site index · List index
Message view « Date » · « Thread »
Top « Date » · « Thread »
From "Dmitriy Pavlov (JIRA)" <j...@apache.org>
Subject [jira] [Updated] (IGNITE-3663) Failed test: Sporadic failures to WebSessionSelfTest.testSessionRenewalDuringLogin()
Date Fri, 04 Aug 2017 17:50:00 GMT

     [ https://issues.apache.org/jira/browse/IGNITE-3663?page=com.atlassian.jira.plugin.system.issuetabpanels:all-tabpanel
]

Dmitriy Pavlov updated IGNITE-3663:
-----------------------------------
    Labels: Muted_test  (was: )

> Failed test: Sporadic failures to WebSessionSelfTest.testSessionRenewalDuringLogin()
> ------------------------------------------------------------------------------------
>
>                 Key: IGNITE-3663
>                 URL: https://issues.apache.org/jira/browse/IGNITE-3663
>             Project: Ignite
>          Issue Type: Bug
>          Components: websession
>    Affects Versions: 1.6
>            Reporter: Vladimir Ozerov
>              Labels: Muted_test
>
> Stack trace: 
> {code}
> java.io.FileNotFoundException: \tmp\realm.properties (The system cannot find the path
specified)
>     at java.io.FileOutputStream.open(Native Method)
>     at java.io.FileOutputStream.<init>(FileOutputStream.java:221)
>     at java.io.FileOutputStream.<init>(FileOutputStream.java:171)
>     at java.io.FileWriter.<init>(FileWriter.java:90)
>     at org.apache.ignite.internal.websession.WebSessionSelfTest.createRealm(WebSessionSelfTest.java:895)
>     at org.apache.ignite.internal.websession.WebSessionSelfTest.startServerWithLoginService(WebSessionSelfTest.java:856)
>     at org.apache.ignite.internal.websession.WebSessionSelfTest.testSessionRenewalDuringLogin(WebSessionSelfTest.java:308)
>     at org.apache.ignite.internal.websession.WebSessionSelfTest.testSessionRenewalDuringLogin(WebSessionSelfTest.java:92)
> ------- Stdout: -------
> [09:22:21,509][INFO ][main][root] >>> Starting test: WebSessionSelfTest#testSessionRenewalDuringLogin
<<<
> [09:22:21,524][INFO ][main][root] >>> Stopping test: WebSessionSelfTest#testSessionRenewalDuringLogin
in 15 ms <<<
> [09:22:21,524][INFO ][main][root] >>> Stopping test class: WebSessionSelfTest
<<<
> ------- Stderr: -------
> [09:22:21,522][ERROR][main][root] Test failed.
> java.io.FileNotFoundException: \tmp\realm.properties (The system cannot find the path
specified)
>     at java.io.FileOutputStream.open(Native Method)
>     at java.io.FileOutputStream.<init>(FileOutputStream.java:221)
>     at java.io.FileOutputStream.<init>(FileOutputStream.java:171)
>     at java.io.FileWriter.<init>(FileWriter.java:90)
>     at org.apache.ignite.internal.websession.WebSessionSelfTest.createRealm(WebSessionSelfTest.java:895)
>     at org.apache.ignite.internal.websession.WebSessionSelfTest.startServerWithLoginService(WebSessionSelfTest.java:856)
>     at org.apache.ignite.internal.websession.WebSessionSelfTest.testSessionRenewalDuringLogin(WebSessionSelfTest.java:308)
>     at org.apache.ignite.internal.websession.WebSessionSelfTest.testSessionRenewalDuringLogin(WebSessionSelfTest.java:92)
>     at sun.reflect.NativeMethodAccessorImpl.invoke0(Native Method)
>     at sun.reflect.NativeMethodAccessorImpl.invoke(NativeMethodAccessorImpl.java:57)
>     at sun.reflect.DelegatingMethodAccessorImpl.invoke(DelegatingMethodAccessorImpl.java:43)
>     at java.lang.reflect.Method.invoke(Method.java:606)
>     at junit.framework.TestCase.runTest(TestCase.java:176)
>     at org.apache.ignite.testframework.junits.GridAbstractTest.runTestInternal(GridAbstractTest.java:1760)
>     at org.apache.ignite.testframework.junits.GridAbstractTest.access$000(GridAbstractTest.java:118)
>     at org.apache.ignite.testframework.junits.GridAbstractTest$4.run(GridAbstractTest.java:1698)
>     at java.lang.Thread.run(Thread.java:745)
> {code}



--
This message was sent by Atlassian JIRA
(v6.4.14#64029)

Mime
View raw message