ignite-dev mailing list archives

Site index · List index
Message view « Date » · « Thread »
Top « Date » · « Thread »
From Vyacheslav Daradur <daradu...@gmail.com>
Subject Re: build failure in the master branch
Date Wed, 12 Apr 2017 10:37:43 GMT
Does anyone has the same problem?

2017-04-12 12:30 GMT+03:00 Vyacheslav Daradur <daradurvs@gmail.com>:

> Last commit [1] 12.04.2017 6:19:06
>
> mvn -X clean package -DskipTests
>
> result:
> ***
> [DEBUG] parsing done in 2ms.
> JavaDoc error: 'Other Packages' section should not be present, all
> packages shou
> ld have corresponding documentation groups: C:\Users\SBT-Daradur-V\
> Projects\igni
> te\target\javadoc\core/overview-summary.html
> [DEBUG] parsing started
> [DEBUG] DomTree builder started.
> [DEBUG] LagartoDom tree created in 4 ms.
> [DEBUG] parsing done in 5ms.
> [DEBUG] parsing started
> [DEBUG] DomTree builder started.
> [DEBUG] LagartoDom tree created in 4 ms.
> [DEBUG] parsing done in 4ms.
> [INFO] ------------------------------------------------------------
> ------------
> [INFO] Reactor Summary:
> [INFO]
> [INFO] ignite-apache-license-gen .......................... SUCCESS [
>  1.473 s]
> [INFO] ignite-tools ....................................... SUCCESS [
>  5.950 s]
> [INFO] ignite-core ........................................ SUCCESS
> [02:25 min]
> [INFO] ignite-log4j ....................................... SUCCESS [
>  4.440 s]
> [INFO] ignite-indexing .................................... SUCCESS [
> 12.198 s]
> [INFO] ignite-urideploy ................................... SUCCESS [
>  4.338 s]
> [INFO] ignite-spring ...................................... SUCCESS [
>  5.500 s]
> [INFO] ignite-hadoop ...................................... SUCCESS [
> 15.860 s]
> [INFO] ignite-extdata-p2p ................................. SUCCESS [
>  4.629 s]
> [INFO] ignite-extdata-uri-dep ............................. SUCCESS [
>  2.210 s]
> [INFO] ignite-extdata-uri ................................. SUCCESS [
>  1.033 s]
> [INFO] ignite-rest-http ................................... SUCCESS [
>  4.003 s]
> [INFO] ignite-clients ..................................... SUCCESS [
>  2.153 s]
> [INFO] ignite-spring-data ................................. SUCCESS [
>  3.284 s]
> [INFO] ignite-web ......................................... SUCCESS [
>  3.487 s]
> [INFO] ignite-aop ......................................... SUCCESS [
>  3.365 s]
> [INFO] ignite-ssh ......................................... SUCCESS [
>  3.135 s]
> [INFO] ignite-jta ......................................... SUCCESS [
>  3.762 s]
> [INFO] ignite-aws ......................................... SUCCESS [
>  3.550 s]
> [INFO] ignite-log4j2 ...................................... SUCCESS [
>  3.074 s]
> [INFO] ignite-slf4j ....................................... SUCCESS [
>  2.650 s]
> [INFO] ignite-jcl ......................................... SUCCESS [
>  2.515 s]
> [INFO] ignite-codegen ..................................... SUCCESS [
>  2.364 s]
> [INFO] ignite-gce ......................................... SUCCESS [
>  2.713 s]
> [INFO] ignite-cloud ....................................... SUCCESS [
>  4.806 s]
> [INFO] ignite-mesos ....................................... SUCCESS [
>  4.260 s]
> [INFO] ignite-kafka ....................................... SUCCESS [
>  4.889 s]
> [INFO] ignite-flume ....................................... SUCCESS [
>  3.584 s]
> [INFO] ignite-yarn ........................................ SUCCESS [
> 10.306 s]
> [INFO] ignite-jms11 ....................................... SUCCESS [
>  3.234 s]
> [INFO] ignite-twitter ..................................... SUCCESS [
>  3.141 s]
> [INFO] ignite-mqtt ........................................ SUCCESS [
>  3.578 s]
> [INFO] ignite-zookeeper ................................... SUCCESS [
>  3.395 s]
> [INFO] ignite-camel ....................................... SUCCESS [
>  3.579 s]
> [INFO] ignite-storm ....................................... SUCCESS [
>  3.147 s]
> [INFO] ignite-osgi-paxlogging ............................. SUCCESS [
>  0.728 s]
> [INFO] ignite-osgi-karaf .................................. SUCCESS [
>  0.381 s]
> [INFO] ignite-osgi ........................................ SUCCESS [
>  4.074 s]
> [INFO] ignite-appserver-test .............................. SUCCESS [
>  0.591 s]
> [INFO] ignite-websphere-test .............................. SUCCESS [
>  3.345 s]
> [INFO] ignite-cassandra ................................... SUCCESS [
>  0.355 s]
> [INFO] ignite-cassandra-store ............................. SUCCESS [
> 10.290 s]
> [INFO] ignite-cassandra-serializers ....................... SUCCESS [
>  3.740 s]
> [INFO] ignite-flink ....................................... SUCCESS [
>  3.553 s]
> [INFO] ignite-kubernetes .................................. SUCCESS [
>  2.646 s]
> [INFO] ignite-zeromq ...................................... SUCCESS [
>  2.621 s]
> [INFO] ignite-scalar ...................................... SUCCESS [
> 32.786 s]
> [INFO] ignite-spark ....................................... SUCCESS [
> 12.782 s]
> [INFO] ignite-visor-console ............................... SUCCESS [
> 33.341 s]
> [INFO] ignite-visor-plugins ............................... SUCCESS [
>  2.912 s]
> [INFO] apache-ignite ...................................... FAILURE [
> 50.691 s]
> [INFO] ------------------------------------------------------------
> ------------
> [INFO] BUILD FAILURE
> [INFO] ------------------------------------------------------------
> ------------
> [INFO] Total time: 07:37 min
> [INFO] Finished at: 2017-04-12T12:27:59+03:00
> [INFO] Final Memory: 293M/1488M
> [INFO] ------------------------------------------------------------
> ------------
> [ERROR] Failed to execute goal org.apache.maven.plugins:
> maven-antrun-plugin:1.7:
> run (javadoc-postprocessing) on project apache-ignite: An Ant
> BuildException has
>  occured: Execution failed due to previous errors.
> [ERROR] around Ant part ...<doctask css="dotted"
> dir="target/javadoc/core">... @
>  11:51 in C:\Users\SBT-Daradur-V\Projects\ignite\target\antrun\
> build-main.xml
> [ERROR] -> [Help 1]
> org.apache.maven.lifecycle.LifecycleExecutionException: Failed to execute
> goal o
> rg.apache.maven.plugins:maven-antrun-plugin:1.7:run
> (javadoc-postprocessing) on
> project apache-ignite: An Ant BuildException has occured: Execution failed
> due t
> o previous errors.
> around Ant part ...<doctask css="dotted" dir="target/javadoc/core">... @
> 11:51 i
> n C:\Users\SBT-Daradur-V\Projects\ignite\target\antrun\build-main.xml
>         at org.apache.maven.lifecycle.internal.MojoExecutor.execute(
> MojoExecutor
> .java:212)
>         at org.apache.maven.lifecycle.internal.MojoExecutor.execute(
> MojoExecutor
> .java:153)
>         at org.apache.maven.lifecycle.internal.MojoExecutor.execute(
> MojoExecutor
> .java:145)
>         at org.apache.maven.lifecycle.internal.LifecycleModuleBuilder.
> buildProje
> ct(LifecycleModuleBuilder.java:116)
>         at org.apache.maven.lifecycle.internal.LifecycleModuleBuilder.
> buildProje
> ct(LifecycleModuleBuilder.java:80)
>         at org.apache.maven.lifecycle.internal.builder.
> singlethreaded.SingleThre
> adedBuilder.build(SingleThreadedBuilder.java:51)
>         at org.apache.maven.lifecycle.internal.LifecycleStarter.
> execute(Lifecycl
> eStarter.java:128)
>         at org.apache.maven.DefaultMaven.doExecute(DefaultMaven.java:307)
>         at org.apache.maven.DefaultMaven.doExecute(DefaultMaven.java:193)
>         at org.apache.maven.DefaultMaven.execute(DefaultMaven.java:106)
>         at org.apache.maven.cli.MavenCli.execute(MavenCli.java:863)
>         at org.apache.maven.cli.MavenCli.doMain(MavenCli.java:288)
>         at org.apache.maven.cli.MavenCli.main(MavenCli.java:199)
>         at sun.reflect.NativeMethodAccessorImpl.invoke0(Native Method)
>         at sun.reflect.NativeMethodAccessorImpl.invoke(
> NativeMethodAccessorImpl.
> java:62)
>         at sun.reflect.DelegatingMethodAccessorImpl.
> invoke(DelegatingMethodAcces
> sorImpl.java:43)
>         at java.lang.reflect.Method.invoke(Method.java:498)
>         at org.codehaus.plexus.classworlds.launcher.Launcher.
> launchEnhanced(Laun
> cher.java:289)
>         at org.codehaus.plexus.classworlds.launcher.Launcher.
> launch(Launcher.jav
> a:229)
>         at org.codehaus.plexus.classworlds.launcher.Launcher.
> mainWithExitCode(La
> uncher.java:415)
>         at org.codehaus.plexus.classworlds.launcher.Launcher.
> main(Launcher.java:
> 356)
> Caused by: org.apache.maven.plugin.MojoExecutionException: An Ant
> BuildException
>  has occured: Execution failed due to previous errors.
> around Ant part ...<doctask css="dotted" dir="target/javadoc/core">... @
> 11:51 i
> n C:\Users\SBT-Daradur-V\Projects\ignite\target\antrun\build-main.xml
>         at org.apache.maven.plugin.antrun.AntRunMojo.execute(
> AntRunMojo.java:355
> )
>         at org.apache.maven.plugin.DefaultBuildPluginManager.
> executeMojo(Default
> BuildPluginManager.java:134)
>         at org.apache.maven.lifecycle.internal.MojoExecutor.execute(
> MojoExecutor
> .java:207)
>         ... 20 more
> Caused by: C:\Users\SBT-Daradur-V\Projects\ignite\target\antrun\
> build-main.xml:1
> 1: Execution failed due to previous errors.
>         at org.apache.ignite.tools.ant.beautifier.GridJavadocAntTask.
> execute(Gri
> dJavadocAntTask.java:137)
>         at org.apache.tools.ant.UnknownElement.execute(
> UnknownElement.java:291)
>         at sun.reflect.NativeMethodAccessorImpl.invoke0(Native Method)
>         at sun.reflect.NativeMethodAccessorImpl.invoke(
> NativeMethodAccessorImpl.
> java:62)
>         at sun.reflect.DelegatingMethodAccessorImpl.
> invoke(DelegatingMethodAcces
> sorImpl.java:43)
>         at java.lang.reflect.Method.invoke(Method.java:498)
>         at org.apache.tools.ant.dispatch.DispatchUtils.execute(
> DispatchUtils.jav
> a:106)
>         at org.apache.tools.ant.Task.perform(Task.java:348)
>         at org.apache.tools.ant.Target.execute(Target.java:390)
>         at org.apache.tools.ant.Target.performTasks(Target.java:411)
>         at org.apache.tools.ant.Project.executeSortedTargets(Project.
> java:1399)
>         at org.apache.tools.ant.Project.executeTarget(Project.java:1368)
>         at org.apache.maven.plugin.antrun.AntRunMojo.execute(
> AntRunMojo.java:327
> )
>         ... 22 more
> [ERROR]
> [ERROR]
> [ERROR] For more information about the errors and possible solutions,
> please rea
> d the following articles:
> [ERROR] [Help 1] http://cwiki.apache.org/confluence/display/MAVEN/
> MojoExecutionE
> xception
> [ERROR]
> [ERROR] After correcting the problems, you can resume the build with the
> command
> ***
>
> Looks like we have new hook on hierarchy of java-packages .
>
> [1] https://github.com/apache/ignite/commit/8c9c60a48e3431950791c8cfeb9236
> f6d034e1cb
>



-- 
Best Regards, Vyacheslav

Mime
  • Unnamed multipart/alternative (inline, None, 0 bytes)
View raw message