ignite-dev mailing list archives

Site index · List index
Message view « Date » · « Thread »
Top « Date » · « Thread »
From "Stanilovsky Evgeny (JIRA)" <j...@apache.org>
Subject [jira] [Created] (IGNITE-4654) GridMarshallerPerformanceTest fail
Date Fri, 03 Feb 2017 13:21:51 GMT
Stanilovsky Evgeny created IGNITE-4654:
------------------------------------------

             Summary: GridMarshallerPerformanceTest fail
                 Key: IGNITE-4654
                 URL: https://issues.apache.org/jira/browse/IGNITE-4654
             Project: Ignite
          Issue Type: Bug
    Affects Versions: 2.0
            Reporter: Stanilovsky Evgeny
            Priority: Minor


NPE fail
{code}
[13:46:49,678][INFO ][main][root] >>> Starting test class: GridMarshallerPerformanceTest
<<<
[13:46:49,688][INFO ][main][root] >>> Starting test: GridMarshallerPerformanceTest#testGridMarshaller
<<<
[13:46:49,694][ERROR][main][root] Test failed.
class org.apache.ignite.internal.util.lang.GridClosureException: Failed to serialize object:
org.apache.ignite.marshaller.GridMarshallerPerformanceTest$TestObject@d0bb6d5
        at org.apache.ignite.internal.util.lang.GridFunc.wrap(GridFunc.java:4582)
        at org.apache.ignite.internal.util.lang.IgniteInClosureX.apply(IgniteInClosureX.java:41)
        at org.apache.ignite.marshaller.GridMarshallerPerformanceTest.runTest(GridMarshallerPerformanceTest.java:236)
        at org.apache.ignite.marshaller.GridMarshallerPerformanceTest.testGridMarshaller(GridMarshallerPerformanceTest.java:132)
        at sun.reflect.NativeMethodAccessorImpl.invoke0(Native Method)
        at sun.reflect.NativeMethodAccessorImpl.invoke(NativeMethodAccessorImpl.java:62)
        at sun.reflect.DelegatingMethodAccessorImpl.invoke(DelegatingMethodAccessorImpl.java:43)
        at java.lang.reflect.Method.invoke(Method.java:498)
        at junit.framework.TestCase.runTest(TestCase.java:176)
        at org.apache.ignite.testframework.junits.GridAbstractTest.runTestInternal(GridAbstractTest.java:1803)
        at org.apache.ignite.testframework.junits.GridAbstractTest.access$000(GridAbstractTest.java:118)
        at org.apache.ignite.testframework.junits.GridAbstractTest$4.run(GridAbstractTest.java:1718)
        at java.lang.Thread.run(Thread.java:745)
Caused by: class org.apache.ignite.IgniteCheckedException: Failed to serialize object: org.apache.ignite.marshaller.GridMarshallerPerformanceTest$TestObject@d0bb6d5
        at org.apache.ignite.marshaller.optimized.OptimizedMarshaller.marshal0(OptimizedMarshaller.java:197)
        at org.apache.ignite.marshaller.AbstractNodeNameAwareMarshaller.marshal(AbstractNodeNameAwareMarshaller.java:58)
        at org.apache.ignite.marshaller.GridMarshallerPerformanceTest$3.applyx(GridMarshallerPerformanceTest.java:122)
        at org.apache.ignite.marshaller.GridMarshallerPerformanceTest$3.applyx(GridMarshallerPerformanceTest.java:120)
        at org.apache.ignite.internal.util.lang.IgniteInClosureX.apply(IgniteInClosureX.java:38)
        ... 11 more
Caused by: java.lang.NullPointerException
{code}



--
This message was sent by Atlassian JIRA
(v6.3.15#6346)

Mime
View raw message