ignite-dev mailing list archives

Site index · List index
Message view « Date » · « Thread »
Top « Date » · « Thread »
From "Sergey Kozlov (JIRA)" <j...@apache.org>
Subject [jira] [Created] (IGNITE-1344) Unable to build ignite example under JDK1.8
Date Tue, 01 Sep 2015 11:07:45 GMT
Sergey Kozlov created IGNITE-1344:
-------------------------------------

             Summary: Unable to build ignite example under JDK1.8
                 Key: IGNITE-1344
                 URL: https://issues.apache.org/jira/browse/IGNITE-1344
             Project: Ignite
          Issue Type: Bug
          Components: general
    Affects Versions: ignite-1.4
            Reporter: Sergey Kozlov
            Assignee: Yakov Zhdanov
            Priority: Critical
             Fix For: ignite-1.4


{noformat}
[ERROR] COMPILATION ERROR : 
[INFO] -------------------------------------------------------------
[ERROR] /D:/1.4/gridgain-community-fabric-1.4.1-QAIS3103/examples/src/main/java8/org/apache/ignite/examples/java8/messaging/MessagingExample.java:[101,46]
cannot find symbol
  symbol:   class Ignite
  location: class org.apache.ignite.examples.java8.messaging.MessagingExample
[ERROR] /D:/1.4/gridgain-community-fabric-1.4.1-QAIS3103/examples/src/main/java8/org/apache/ignite/examples/java8/messaging/MessagingExample.java:[101,61]
cannot find symbol
  symbol:   class IgniteMessaging
  location: class org.apache.ignite.examples.java8.messaging.MessagingExample
[ERROR] /D:/1.4/gridgain-community-fabric-1.4.1-QAIS3103/examples/src/main/java8/org/apache/ignite/examples/java8/messaging/MessagingExample.java:[101,90]
cannot find symbol
  symbol:   class IgniteException
  location: class org.apache.ignite.examples.java8.messaging.MessagingExample
[ERROR] /D:/1.4/gridgain-community-fabric-1.4.1-QAIS3103/examples/src/main/java8/org/apache/ignite/examples/java8/messaging/MessagingExample.java:[139,9]
cannot find symbol
  symbol:   class IgniteMessaging
  location: class org.apache.ignite.examples.java8.messaging.MessagingExample
[ERROR] /D:/1.4/gridgain-community-fabric-1.4.1-QAIS3103/examples/src/main/java8/org/apache/ignite/examples/java8/messaging/MessagingExample.java:[140,15]
cannot find symbol
  symbol:   class CountDownLatch
  location: class org.apache.ignite.examples.java8.messaging.MessagingExample
[ERROR] /D:/1.4/gridgain-community-fabric-1.4.1-QAIS3103/examples/src/main/java8/org/apache/ignite/examples/java8/messaging/MessagingExample.java:[141,15]
cannot find symbol
  symbol:   class CountDownLatch
  location: class org.apache.ignite.examples.java8.messaging.MessagingExample
[ERROR] /D:/1.4/gridgain-community-fabric-1.4.1-QAIS3103/examples/src/main/java8/org/apache/ignite/examples/java8/datagrid/CacheAffinityExample.java:[44,51]
cannot find symbol
  symbol:   class IgniteException
  location: class org.apache.ignite.examples.java8.datagrid.CacheAffinityExample
[ERROR] /D:/1.4/gridgain-community-fabric-1.4.1-QAIS3103/examples/src/main/java8/org/apache/ignite/examples/java8/messaging/MessagingExample.java:[47,14]
cannot find symbol
  symbol:   class Ignite
  location: class org.apache.ignite.examples.java8.messaging.MessagingExample
[ERROR] /D:/1.4/gridgain-community-fabric-1.4.1-QAIS3103/examples/src/main/java8/org/apache/ignite/examples/java8/messaging/MessagingExample.java:[47,30]
cannot find symbol
  symbol:   variable Ignition
  location: class org.apache.ignite.examples.java8.messaging.MessagingExample
[ERROR] /D:/1.4/gridgain-community-fabric-1.4.1-QAIS3103/examples/src/main/java8/org/apache/ignite/examples/java8/messaging/MessagingExample.java:[48,18]
cannot find symbol
  symbol:   variable ExamplesUtils
  location: class org.apache.ignite.examples.java8.messaging.MessagingExample
[ERROR] /D:/1.4/gridgain-community-fabric-1.4.1-QAIS3103/examples/src/main/java8/org/apache/ignite/examples/java8/messaging/MessagingExample.java:[60,13]
cannot find symbol
  symbol:   class ClusterGroup
  location: class org.apache.ignite.examples.java8.messaging.MessagingExample
[ERROR] /D:/1.4/gridgain-community-fabric-1.4.1-QAIS3103/examples/src/main/java8/org/apache/ignite/examples/java8/messaging/MessagingExample.java:[65,13]
cannot find symbol
  symbol:   class CountDownLatch
  location: class org.apache.ignite.examples.java8.messaging.MessagingExample
[ERROR] /D:/1.4/gridgain-community-fabric-1.4.1-QAIS3103/examples/src/main/java8/org/apache/ignite/examples/java8/messaging/MessagingExample.java:[65,47]
cannot find symbol
  symbol:   class CountDownLatch
  location: class org.apache.ignite.examples.java8.messaging.MessagingExample
[ERROR] /D:/1.4/gridgain-community-fabric-1.4.1-QAIS3103/examples/src/main/java8/org/apache/ignite/examples/java8/messaging/MessagingExample.java:[66,13]
cannot find symbol
  symbol:   class CountDownLatch
  location: class org.apache.ignite.examples.java8.messaging.MessagingExample
[ERROR] /D:/1.4/gridgain-community-fabric-1.4.1-QAIS3103/examples/src/main/java8/org/apache/ignite/examples/java8/messaging/MessagingExample.java:[66,49]
cannot find symbol
  symbol:   class CountDownLatch
  location: class org.apache.ignite.examples.java8.messaging.MessagingExample
[ERROR] /D:/1.4/gridgain-community-fabric-1.4.1-QAIS3103/examples/src/main/java8/org/apache/ignite/examples/java8/messaging/MessagingExample.java:[109,20]
cannot find symbol
  symbol:   class IgniteException
  location: class org.apache.ignite.examples.java8.messaging.MessagingExample
[ERROR] /D:/1.4/gridgain-community-fabric-1.4.1-QAIS3103/examples/src/main/java8/org/apache/ignite/examples/java8/messaging/MessagingExample.java:[123,20]
cannot find symbol
  symbol:   class IgniteException
  location: class org.apache.ignite.examples.java8.messaging.MessagingExample
[ERROR] /D:/1.4/gridgain-community-fabric-1.4.1-QAIS3103/examples/src/main/java8/org/apache/ignite/examples/java8/datagrid/CacheAffinityExample.java:[45,14]
cannot find symbol
  symbol:   class Ignite
  location: class org.apache.ignite.examples.java8.datagrid.CacheAffinityExample
[ERROR] /D:/1.4/gridgain-community-fabric-1.4.1-QAIS3103/examples/src/main/java8/org/apache/ignite/examples/java8/datagrid/CacheAffinityExample.java:[45,30]
cannot find symbol
  symbol:   variable Ignition
  location: class org.apache.ignite.examples.java8.datagrid.CacheAffinityExample
[ERROR] /D:/1.4/gridgain-community-fabric-1.4.1-QAIS3103/examples/src/main/java8/org/apache/ignite/examples/java8/datagrid/CacheAffinityExample.java:[49,13]
cannot find symbol
  symbol:   class CacheConfiguration
  location: class org.apache.ignite.examples.java8.datagrid.CacheAffinityExample
[ERROR] /D:/1.4/gridgain-community-fabric-1.4.1-QAIS3103/examples/src/main/java8/org/apache/ignite/examples/java8/datagrid/CacheAffinityExample.java:[49,59]
cannot find symbol
  symbol:   class CacheConfiguration
  location: class org.apache.ignite.examples.java8.datagrid.CacheAffinityExample
[ERROR] /D:/1.4/gridgain-community-fabric-1.4.1-QAIS3103/examples/src/main/java8/org/apache/ignite/examples/java8/datagrid/CacheAffinityExample.java:[51,30]
cannot find symbol
  symbol:   variable CacheMode
  location: class org.apache.ignite.examples.java8.datagrid.CacheAffinityExample
[ERROR] /D:/1.4/gridgain-community-fabric-1.4.1-QAIS3103/examples/src/main/java8/org/apache/ignite/examples/java8/datagrid/CacheAffinityExample.java:[54,18]
cannot find symbol
  symbol:   class IgniteCache
  location: class org.apache.ignite.examples.java8.datagrid.CacheAffinityExample
[ERROR] /D:/1.4/gridgain-community-fabric-1.4.1-QAIS3103/examples/src/main/java8/org/apache/ignite/examples/java8/datagrid/CacheAffinityExample.java:[72,9]
cannot find symbol
  symbol:   class Ignite
  location: class org.apache.ignite.examples.java8.datagrid.CacheAffinityExample
[ERROR] /D:/1.4/gridgain-community-fabric-1.4.1-QAIS3103/examples/src/main/java8/org/apache/ignite/examples/java8/datagrid/CacheAffinityExample.java:[72,25]
cannot find symbol
  symbol:   variable Ignition
  location: class org.apache.ignite.examples.java8.datagrid.CacheAffinityExample
[ERROR] /D:/1.4/gridgain-community-fabric-1.4.1-QAIS3103/examples/src/main/java8/org/apache/ignite/examples/java8/datagrid/CacheAffinityExample.java:[74,15]
cannot find symbol
  symbol:   class IgniteCache
  location: class org.apache.ignite.examples.java8.datagrid.CacheAffinityExample
[ERROR] /D:/1.4/gridgain-community-fabric-1.4.1-QAIS3103/examples/src/main/java8/org/apache/ignite/examples/java8/datagrid/CacheAffinityExample.java:[93,15]
cannot find symbol
  symbol:   class Ignite
  location: class org.apache.ignite.examples.java8.datagrid.CacheAffinityExample
[ERROR] /D:/1.4/gridgain-community-fabric-1.4.1-QAIS3103/examples/src/main/java8/org/apache/ignite/examples/java8/datagrid/CacheAffinityExample.java:[93,31]
cannot find symbol
  symbol:   variable Ignition
  location: class org.apache.ignite.examples.java8.datagrid.CacheAffinityExample
[ERROR] /D:/1.4/gridgain-community-fabric-1.4.1-QAIS3103/examples/src/main/java8/org/apache/ignite/examples/java8/datagrid/CacheAffinityExample.java:[95,9]
cannot find symbol
  symbol:   class Collection
  location: class org.apache.ignite.examples.java8.datagrid.CacheAffinityExample
[ERROR] /D:/1.4/gridgain-community-fabric-1.4.1-QAIS3103/examples/src/main/java8/org/apache/ignite/examples/java8/datagrid/CacheAffinityExample.java:[95,40]
cannot find symbol
  symbol:   class ArrayList
  location: class org.apache.ignite.examples.java8.datagrid.CacheAffinityExample
[ERROR] /D:/1.4/gridgain-community-fabric-1.4.1-QAIS3103/examples/src/main/java8/org/apache/ignite/examples/java8/datagrid/CacheAffinityExample.java:[101,9]
cannot find symbol
  symbol:   class Map
  location: class org.apache.ignite.examples.java8.datagrid.CacheAffinityExample
[ERROR] /D:/1.4/gridgain-community-fabric-1.4.1-QAIS3103/examples/src/main/java8/org/apache/ignite/examples/java8/datagrid/CacheAffinityExample.java:[101,13]
cannot find symbol
  symbol:   class ClusterNode
  location: class org.apache.ignite.examples.java8.datagrid.CacheAffinityExample
[ERROR] /D:/1.4/gridgain-community-fabric-1.4.1-QAIS3103/examples/src/main/java8/org/apache/ignite/examples/java8/datagrid/CacheAffinityExample.java:[101,26]
cannot find symbol
  symbol:   class Collection
  location: class org.apache.ignite.examples.java8.datagrid.CacheAffinityExample
[ERROR] /D:/1.4/gridgain-community-fabric-1.4.1-QAIS3103/examples/src/main/java8/org/apache/ignite/examples/java8/datagrid/CacheAffinityExample.java:[103,17]
package Map does not exist
[ERROR] /D:/1.4/gridgain-community-fabric-1.4.1-QAIS3103/examples/src/main/java8/org/apache/ignite/examples/java8/datagrid/CacheAffinityExample.java:[103,24]
cannot find symbol
  symbol:   class ClusterNode
  location: class org.apache.ignite.examples.java8.datagrid.CacheAffinityExample
[ERROR] /D:/1.4/gridgain-community-fabric-1.4.1-QAIS3103/examples/src/main/java8/org/apache/ignite/examples/java8/datagrid/CacheAffinityExample.java:[103,37]
cannot find symbol
  symbol:   class Collection
  location: class org.apache.ignite.examples.java8.datagrid.CacheAffinityExample
[ERROR] /D:/1.4/gridgain-community-fabric-1.4.1-QAIS3103/examples/src/main/java8/org/apache/ignite/examples/java8/datagrid/CacheAffinityExample.java:[104,13]
cannot find symbol
  symbol:   class ClusterNode
  location: class org.apache.ignite.examples.java8.datagrid.CacheAffinityExample
[ERROR] /D:/1.4/gridgain-community-fabric-1.4.1-QAIS3103/examples/src/main/java8/org/apache/ignite/examples/java8/datagrid/CacheAffinityExample.java:[106,19]
cannot find symbol
  symbol:   class Collection
  location: class org.apache.ignite.examples.java8.datagrid.CacheAffinityExample
[ERROR] /D:/1.4/gridgain-community-fabric-1.4.1-QAIS3103/examples/src/main/java8/org/apache/ignite/examples/java8/datagrid/CacheAffinityExample.java:[111,21]
cannot find symbol
  symbol:   class IgniteCache
  location: class org.apache.ignite.examples.java8.datagrid.CacheAffinityExample
[INFO] 39 errors 
[INFO] -------------------------------------------------------------
[INFO] ------------------------------------------------------------------------
[INFO] BUILD FAILURE
[INFO] ------------------------------------------------------------------------
[INFO] Total time: 37.138 s
[INFO] Finished at: 2015-09-01T12:40:28+03:00
[INFO] Final Memory: 22M/108M
[INFO] ------------------------------------------------------------------------
[ERROR] Failed to execute goal org.apache.maven.plugins:maven-compiler-plugin:3.1:compile
(default-compile) on project ignite-examples: Compilation failure: Compilation failure:
[ERROR] /D:/1.4/gridgain-community-fabric-1.4.1-QAIS3103/examples/src/main/java8/org/apache/ignite/examples/java8/messaging/MessagingExample.java:[101,46]
cannot find symbol
[ERROR] symbol:   class Ignite
[ERROR] location: class org.apache.ignite.examples.java8.messaging.MessagingExample
[ERROR] /D:/1.4/gridgain-community-fabric-1.4.1-QAIS3103/examples/src/main/java8/org/apache/ignite/examples/java8/messaging/MessagingExample.java:[101,61]
cannot find symbol
[ERROR] symbol:   class IgniteMessaging
[ERROR] location: class org.apache.ignite.examples.java8.messaging.MessagingExample
[ERROR] /D:/1.4/gridgain-community-fabric-1.4.1-QAIS3103/examples/src/main/java8/org/apache/ignite/examples/java8/messaging/MessagingExample.java:[101,90]
cannot find symbol
[ERROR] symbol:   class IgniteException
[ERROR] location: class org.apache.ignite.examples.java8.messaging.MessagingExample
[ERROR] /D:/1.4/gridgain-community-fabric-1.4.1-QAIS3103/examples/src/main/java8/org/apache/ignite/examples/java8/messaging/MessagingExample.java:[139,9]
cannot find symbol
[ERROR] symbol:   class IgniteMessaging
[ERROR] location: class org.apache.ignite.examples.java8.messaging.MessagingExample
[ERROR] /D:/1.4/gridgain-community-fabric-1.4.1-QAIS3103/examples/src/main/java8/org/apache/ignite/examples/java8/messaging/MessagingExample.java:[140,15]
cannot find symbol
[ERROR] symbol:   class CountDownLatch
[ERROR] location: class org.apache.ignite.examples.java8.messaging.MessagingExample
[ERROR] /D:/1.4/gridgain-community-fabric-1.4.1-QAIS3103/examples/src/main/java8/org/apache/ignite/examples/java8/messaging/MessagingExample.java:[141,15]
cannot find symbol
[ERROR] symbol:   class CountDownLatch
[ERROR] location: class org.apache.ignite.examples.java8.messaging.MessagingExample
[ERROR] /D:/1.4/gridgain-community-fabric-1.4.1-QAIS3103/examples/src/main/java8/org/apache/ignite/examples/java8/datagrid/CacheAffinityExample.java:[44,51]
cannot find symbol
[ERROR] symbol:   class IgniteException
[ERROR] location: class org.apache.ignite.examples.java8.datagrid.CacheAffinityExample
[ERROR] /D:/1.4/gridgain-community-fabric-1.4.1-QAIS3103/examples/src/main/java8/org/apache/ignite/examples/java8/messaging/MessagingExample.java:[47,14]
cannot find symbol
[ERROR] symbol:   class Ignite
[ERROR] location: class org.apache.ignite.examples.java8.messaging.MessagingExample
[ERROR] /D:/1.4/gridgain-community-fabric-1.4.1-QAIS3103/examples/src/main/java8/org/apache/ignite/examples/java8/messaging/MessagingExample.java:[47,30]
cannot find symbol
[ERROR] symbol:   variable Ignition
[ERROR] location: class org.apache.ignite.examples.java8.messaging.MessagingExample
[ERROR] /D:/1.4/gridgain-community-fabric-1.4.1-QAIS3103/examples/src/main/java8/org/apache/ignite/examples/java8/messaging/MessagingExample.java:[48,18]
cannot find symbol
[ERROR] symbol:   variable ExamplesUtils
[ERROR] location: class org.apache.ignite.examples.java8.messaging.MessagingExample
[ERROR] /D:/1.4/gridgain-community-fabric-1.4.1-QAIS3103/examples/src/main/java8/org/apache/ignite/examples/java8/messaging/MessagingExample.java:[60,13]
cannot find symbol
[ERROR] symbol:   class ClusterGroup
[ERROR] location: class org.apache.ignite.examples.java8.messaging.MessagingExample
[ERROR] /D:/1.4/gridgain-community-fabric-1.4.1-QAIS3103/examples/src/main/java8/org/apache/ignite/examples/java8/messaging/MessagingExample.java:[65,13]
cannot find symbol
[ERROR] symbol:   class CountDownLatch
[ERROR] location: class org.apache.ignite.examples.java8.messaging.MessagingExample
[ERROR] /D:/1.4/gridgain-community-fabric-1.4.1-QAIS3103/examples/src/main/java8/org/apache/ignite/examples/java8/messaging/MessagingExample.java:[65,47]
cannot find symbol
[ERROR] symbol:   class CountDownLatch
[ERROR] location: class org.apache.ignite.examples.java8.messaging.MessagingExample
[ERROR] /D:/1.4/gridgain-community-fabric-1.4.1-QAIS3103/examples/src/main/java8/org/apache/ignite/examples/java8/messaging/MessagingExample.java:[66,13]
cannot find symbol
[ERROR] symbol:   class CountDownLatch
[ERROR] location: class org.apache.ignite.examples.java8.messaging.MessagingExample
[ERROR] /D:/1.4/gridgain-community-fabric-1.4.1-QAIS3103/examples/src/main/java8/org/apache/ignite/examples/java8/messaging/MessagingExample.java:[66,49]
cannot find symbol
[ERROR] symbol:   class CountDownLatch
[ERROR] location: class org.apache.ignite.examples.java8.messaging.MessagingExample
[ERROR] /D:/1.4/gridgain-community-fabric-1.4.1-QAIS3103/examples/src/main/java8/org/apache/ignite/examples/java8/messaging/MessagingExample.java:[109,20]
cannot find symbol
[ERROR] symbol:   class IgniteException
[ERROR] location: class org.apache.ignite.examples.java8.messaging.MessagingExample
[ERROR] /D:/1.4/gridgain-community-fabric-1.4.1-QAIS3103/examples/src/main/java8/org/apache/ignite/examples/java8/messaging/MessagingExample.java:[123,20]
cannot find symbol
[ERROR] symbol:   class IgniteException
[ERROR] location: class org.apache.ignite.examples.java8.messaging.MessagingExample
[ERROR] /D:/1.4/gridgain-community-fabric-1.4.1-QAIS3103/examples/src/main/java8/org/apache/ignite/examples/java8/datagrid/CacheAffinityExample.java:[45,14]
cannot find symbol
[ERROR] symbol:   class Ignite
[ERROR] location: class org.apache.ignite.examples.java8.datagrid.CacheAffinityExample
[ERROR] /D:/1.4/gridgain-community-fabric-1.4.1-QAIS3103/examples/src/main/java8/org/apache/ignite/examples/java8/datagrid/CacheAffinityExample.java:[45,30]
cannot find symbol
[ERROR] symbol:   variable Ignition
[ERROR] location: class org.apache.ignite.examples.java8.datagrid.CacheAffinityExample
[ERROR] /D:/1.4/gridgain-community-fabric-1.4.1-QAIS3103/examples/src/main/java8/org/apache/ignite/examples/java8/datagrid/CacheAffinityExample.java:[49,13]
cannot find symbol
[ERROR] symbol:   class CacheConfiguration
[ERROR] location: class org.apache.ignite.examples.java8.datagrid.CacheAffinityExample
[ERROR] /D:/1.4/gridgain-community-fabric-1.4.1-QAIS3103/examples/src/main/java8/org/apache/ignite/examples/java8/datagrid/CacheAffinityExample.java:[49,59]
cannot find symbol
[ERROR] symbol:   class CacheConfiguration
[ERROR] location: class org.apache.ignite.examples.java8.datagrid.CacheAffinityExample
[ERROR] /D:/1.4/gridgain-community-fabric-1.4.1-QAIS3103/examples/src/main/java8/org/apache/ignite/examples/java8/datagrid/CacheAffinityExample.java:[51,30]
cannot find symbol
[ERROR] symbol:   variable CacheMode
[ERROR] location: class org.apache.ignite.examples.java8.datagrid.CacheAffinityExample
[ERROR] /D:/1.4/gridgain-community-fabric-1.4.1-QAIS3103/examples/src/main/java8/org/apache/ignite/examples/java8/datagrid/CacheAffinityExample.java:[54,18]
cannot find symbol
[ERROR] symbol:   class IgniteCache
[ERROR] location: class org.apache.ignite.examples.java8.datagrid.CacheAffinityExample
[ERROR] /D:/1.4/gridgain-community-fabric-1.4.1-QAIS3103/examples/src/main/java8/org/apache/ignite/examples/java8/datagrid/CacheAffinityExample.java:[72,9]
cannot find symbol
[ERROR] symbol:   class Ignite
[ERROR] location: class org.apache.ignite.examples.java8.datagrid.CacheAffinityExample
[ERROR] /D:/1.4/gridgain-community-fabric-1.4.1-QAIS3103/examples/src/main/java8/org/apache/ignite/examples/java8/datagrid/CacheAffinityExample.java:[72,25]
cannot find symbol
[ERROR] symbol:   variable Ignition
[ERROR] location: class org.apache.ignite.examples.java8.datagrid.CacheAffinityExample
[ERROR] /D:/1.4/gridgain-community-fabric-1.4.1-QAIS3103/examples/src/main/java8/org/apache/ignite/examples/java8/datagrid/CacheAffinityExample.java:[74,15]
cannot find symbol
[ERROR] symbol:   class IgniteCache
[ERROR] location: class org.apache.ignite.examples.java8.datagrid.CacheAffinityExample
[ERROR] /D:/1.4/gridgain-community-fabric-1.4.1-QAIS3103/examples/src/main/java8/org/apache/ignite/examples/java8/datagrid/CacheAffinityExample.java:[93,15]
cannot find symbol
[ERROR] symbol:   class Ignite
[ERROR] location: class org.apache.ignite.examples.java8.datagrid.CacheAffinityExample
[ERROR] /D:/1.4/gridgain-community-fabric-1.4.1-QAIS3103/examples/src/main/java8/org/apache/ignite/examples/java8/datagrid/CacheAffinityExample.java:[93,31]
cannot find symbol
[ERROR] symbol:   variable Ignition
[ERROR] location: class org.apache.ignite.examples.java8.datagrid.CacheAffinityExample
[ERROR] /D:/1.4/gridgain-community-fabric-1.4.1-QAIS3103/examples/src/main/java8/org/apache/ignite/examples/java8/datagrid/CacheAffinityExample.java:[95,9]
cannot find symbol
[ERROR] symbol:   class Collection
[ERROR] location: class org.apache.ignite.examples.java8.datagrid.CacheAffinityExample
[ERROR] /D:/1.4/gridgain-community-fabric-1.4.1-QAIS3103/examples/src/main/java8/org/apache/ignite/examples/java8/datagrid/CacheAffinityExample.java:[95,40]
cannot find symbol
[ERROR] symbol:   class ArrayList
[ERROR] location: class org.apache.ignite.examples.java8.datagrid.CacheAffinityExample
[ERROR] /D:/1.4/gridgain-community-fabric-1.4.1-QAIS3103/examples/src/main/java8/org/apache/ignite/examples/java8/datagrid/CacheAffinityExample.java:[101,9]
cannot find symbol
[ERROR] symbol:   class Map
[ERROR] location: class org.apache.ignite.examples.java8.datagrid.CacheAffinityExample
[ERROR] /D:/1.4/gridgain-community-fabric-1.4.1-QAIS3103/examples/src/main/java8/org/apache/ignite/examples/java8/datagrid/CacheAffinityExample.java:[101,13]
cannot find symbol
[ERROR] symbol:   class ClusterNode
[ERROR] location: class org.apache.ignite.examples.java8.datagrid.CacheAffinityExample
[ERROR] /D:/1.4/gridgain-community-fabric-1.4.1-QAIS3103/examples/src/main/java8/org/apache/ignite/examples/java8/datagrid/CacheAffinityExample.java:[101,26]
cannot find symbol
[ERROR] symbol:   class Collection
[ERROR] location: class org.apache.ignite.examples.java8.datagrid.CacheAffinityExample
[ERROR] /D:/1.4/gridgain-community-fabric-1.4.1-QAIS3103/examples/src/main/java8/org/apache/ignite/examples/java8/datagrid/CacheAffinityExample.java:[103,17]
package Map does not exist
[ERROR] /D:/1.4/gridgain-community-fabric-1.4.1-QAIS3103/examples/src/main/java8/org/apache/ignite/examples/java8/datagrid/CacheAffinityExample.java:[103,24]
cannot find symbol
[ERROR] symbol:   class ClusterNode
[ERROR] location: class org.apache.ignite.examples.java8.datagrid.CacheAffinityExample
[ERROR] /D:/1.4/gridgain-community-fabric-1.4.1-QAIS3103/examples/src/main/java8/org/apache/ignite/examples/java8/datagrid/CacheAffinityExample.java:[103,37]
cannot find symbol
[ERROR] symbol:   class Collection
[ERROR] location: class org.apache.ignite.examples.java8.datagrid.CacheAffinityExample
[ERROR] /D:/1.4/gridgain-community-fabric-1.4.1-QAIS3103/examples/src/main/java8/org/apache/ignite/examples/java8/datagrid/CacheAffinityExample.java:[104,13]
cannot find symbol
[ERROR] symbol:   class ClusterNode
[ERROR] location: class org.apache.ignite.examples.java8.datagrid.CacheAffinityExample
[ERROR] /D:/1.4/gridgain-community-fabric-1.4.1-QAIS3103/examples/src/main/java8/org/apache/ignite/examples/java8/datagrid/CacheAffinityExample.java:[106,19]
cannot find symbol
[ERROR] symbol:   class Collection
[ERROR] location: class org.apache.ignite.examples.java8.datagrid.CacheAffinityExample
[ERROR] /D:/1.4/gridgain-community-fabric-1.4.1-QAIS3103/examples/src/main/java8/org/apache/ignite/examples/java8/datagrid/CacheAffinityExample.java:[111,21]
cannot find symbol
[ERROR] symbol:   class IgniteCache
[ERROR] location: class org.apache.ignite.examples.java8.datagrid.CacheAffinityExample
[ERROR] -> [Help 1]
[ERROR] 
[ERROR] To see the full stack trace of the errors, re-run Maven with the -e switch.
[ERROR] Re-run Maven using the -X switch to enable full debug logging.
[ERROR] 
[ERROR] For more information about the errors and possible solutions, please read the following
articles:
[ERROR] [Help 1] http://cwiki.apache.org/confluence/display/MAVEN/MojoFailureException

Process finished with exit code 1
{noformat}



--
This message was sent by Atlassian JIRA
(v6.3.4#6332)

Mime
View raw message