hudi-commits mailing list archives

Site index · List index
Message view « Date » · « Thread »
Top « Date » · « Thread »
From Apache Jenkins Server <jenk...@builds.apache.org>
Subject Build failed in Jenkins: hudi-snapshot-deployment-0.5 #166
Date Wed, 22 Jan 2020 03:39:18 GMT
See <https://builds.apache.org/job/hudi-snapshot-deployment-0.5/166/display/redirect>

Changes:


------------------------------------------
[...truncated 2.02 KB...]
/home/jenkins/tools/maven/apache-maven-3.5.4:
bin
boot
conf
lib
LICENSE
NOTICE
README.txt

/home/jenkins/tools/maven/apache-maven-3.5.4/bin:
m2.conf
mvn
mvn.cmd
mvnDebug
mvnDebug.cmd
mvnyjp

/home/jenkins/tools/maven/apache-maven-3.5.4/boot:
plexus-classworlds-2.5.2.jar

/home/jenkins/tools/maven/apache-maven-3.5.4/conf:
logging
settings.xml
toolchains.xml

/home/jenkins/tools/maven/apache-maven-3.5.4/conf/logging:
simplelogger.properties

/home/jenkins/tools/maven/apache-maven-3.5.4/lib:
aopalliance-1.0.jar
cdi-api-1.0.jar
cdi-api.license
commons-cli-1.4.jar
commons-cli.license
commons-io-2.5.jar
commons-io.license
commons-lang3-3.5.jar
commons-lang3.license
ext
guava-20.0.jar
guice-4.2.0-no_aop.jar
jansi-1.17.1.jar
jansi-native
javax.inject-1.jar
jcl-over-slf4j-1.7.25.jar
jcl-over-slf4j.license
jsr250-api-1.0.jar
jsr250-api.license
maven-artifact-3.5.4.jar
maven-artifact.license
maven-builder-support-3.5.4.jar
maven-builder-support.license
maven-compat-3.5.4.jar
maven-compat.license
maven-core-3.5.4.jar
maven-core.license
maven-embedder-3.5.4.jar
maven-embedder.license
maven-model-3.5.4.jar
maven-model-builder-3.5.4.jar
maven-model-builder.license
maven-model.license
maven-plugin-api-3.5.4.jar
maven-plugin-api.license
maven-repository-metadata-3.5.4.jar
maven-repository-metadata.license
maven-resolver-api-1.1.1.jar
maven-resolver-api.license
maven-resolver-connector-basic-1.1.1.jar
maven-resolver-connector-basic.license
maven-resolver-impl-1.1.1.jar
maven-resolver-impl.license
maven-resolver-provider-3.5.4.jar
maven-resolver-provider.license
maven-resolver-spi-1.1.1.jar
maven-resolver-spi.license
maven-resolver-transport-wagon-1.1.1.jar
maven-resolver-transport-wagon.license
maven-resolver-util-1.1.1.jar
maven-resolver-util.license
maven-settings-3.5.4.jar
maven-settings-builder-3.5.4.jar
maven-settings-builder.license
maven-settings.license
maven-shared-utils-3.2.1.jar
maven-shared-utils.license
maven-slf4j-provider-3.5.4.jar
maven-slf4j-provider.license
org.eclipse.sisu.inject-0.3.3.jar
org.eclipse.sisu.inject.license
org.eclipse.sisu.plexus-0.3.3.jar
org.eclipse.sisu.plexus.license
plexus-cipher-1.7.jar
plexus-cipher.license
plexus-component-annotations-1.7.1.jar
plexus-component-annotations.license
plexus-interpolation-1.24.jar
plexus-interpolation.license
plexus-sec-dispatcher-1.4.jar
plexus-sec-dispatcher.license
plexus-utils-3.1.0.jar
plexus-utils.license
slf4j-api-1.7.25.jar
slf4j-api.license
wagon-file-3.1.0.jar
wagon-file.license
wagon-http-3.1.0-shaded.jar
wagon-http.license
wagon-provider-api-3.1.0.jar
wagon-provider-api.license

/home/jenkins/tools/maven/apache-maven-3.5.4/lib/ext:
README.txt

/home/jenkins/tools/maven/apache-maven-3.5.4/lib/jansi-native:
freebsd32
freebsd64
linux32
linux64
osx
README.txt
windows32
windows64

/home/jenkins/tools/maven/apache-maven-3.5.4/lib/jansi-native/freebsd32:
libjansi.so

/home/jenkins/tools/maven/apache-maven-3.5.4/lib/jansi-native/freebsd64:
libjansi.so

/home/jenkins/tools/maven/apache-maven-3.5.4/lib/jansi-native/linux32:
libjansi.so

/home/jenkins/tools/maven/apache-maven-3.5.4/lib/jansi-native/linux64:
libjansi.so

/home/jenkins/tools/maven/apache-maven-3.5.4/lib/jansi-native/osx:
libjansi.jnilib

/home/jenkins/tools/maven/apache-maven-3.5.4/lib/jansi-native/windows32:
jansi.dll

/home/jenkins/tools/maven/apache-maven-3.5.4/lib/jansi-native/windows64:
jansi.dll
Finished /home/jenkins/tools/maven/apache-maven-3.5.4 Directory Listing :
Detected current version as: 'HUDI_home=<https://builds.apache.org/job/hudi-snapshot-deployment-0.5/ws/>
0.5.2-SNAPSHOT'
[INFO] Scanning for projects...
[INFO] ------------------------------------------------------------------------
[INFO] Reactor Build Order:
[INFO] 
[INFO] Hudi                                                               [pom]
[INFO] hudi-common                                                        [jar]
[INFO] hudi-timeline-service                                              [jar]
[INFO] hudi-hadoop-mr                                                     [jar]
[INFO] hudi-client                                                        [jar]
[INFO] hudi-hive                                                          [jar]
[INFO] hudi-spark_2.11                                                    [jar]
[INFO] hudi-utilities_2.11                                                [jar]
[INFO] hudi-cli                                                           [jar]
[INFO] hudi-hadoop-mr-bundle                                              [jar]
[INFO] hudi-hive-bundle                                                   [jar]
[INFO] hudi-spark-bundle_2.11                                             [jar]
[INFO] hudi-presto-bundle                                                 [jar]
[INFO] hudi-utilities-bundle_2.11                                         [jar]
[INFO] hudi-timeline-server-bundle                                        [jar]
[INFO] hudi-hadoop-docker                                                 [pom]
[INFO] hudi-hadoop-base-docker                                            [pom]
[INFO] hudi-hadoop-namenode-docker                                        [pom]
[INFO] hudi-hadoop-datanode-docker                                        [pom]
[INFO] hudi-hadoop-history-docker                                         [pom]
[INFO] hudi-hadoop-hive-docker                                            [pom]
[INFO] hudi-hadoop-sparkbase-docker                                       [pom]
[INFO] hudi-hadoop-sparkmaster-docker                                     [pom]
[INFO] hudi-hadoop-sparkworker-docker                                     [pom]
[INFO] hudi-hadoop-sparkadhoc-docker                                      [pom]
[INFO] hudi-hadoop-presto-docker                                          [pom]
[INFO] hudi-integ-test                                                    [jar]
[INFO] 
[INFO] ------------------------< org.apache.hudi:hudi >------------------------
[INFO] Building Hudi 0.5.2-SNAPSHOT                                      [1/27]
[INFO] --------------------------------[ pom ]---------------------------------
[INFO] 
[INFO] --- maven-clean-plugin:3.1.0:clean (default-clean) @ hudi ---
[INFO] 
[INFO] --- maven-enforcer-plugin:1.4.1:enforce (enforce-maven-version) @ hudi ---
[INFO] 
[INFO] --- maven-remote-resources-plugin:1.5:process (process-resource-bundles) @ hudi ---
[INFO] 
[INFO] --- maven-checkstyle-plugin:3.0.0:check (default) @ hudi ---
[INFO] Starting audit...
Audit done.
[INFO] 
[INFO] --- maven-site-plugin:3.7.1:attach-descriptor (attach-descriptor) @ hudi ---
[INFO] No site descriptor found: nothing to attach.
[INFO] 
[INFO] --- maven-source-plugin:2.2.1:jar-no-fork (attach-sources) @ hudi ---
[INFO] 
[INFO] --- maven-javadoc-plugin:3.1.1:jar (attach-javadocs) @ hudi ---
[INFO] Not executing Javadoc as the project is not a Java classpath-capable package
[INFO] 
[INFO] --- maven-gpg-plugin:1.4:sign (sign-artifacts) @ hudi ---
gpg: no default secret key: No secret key
gpg: signing failed: No secret key
[INFO] ------------------------------------------------------------------------
[INFO] Reactor Summary:
[INFO] 
[INFO] Hudi 0.5.2-SNAPSHOT ................................ FAILURE [  4.090 s]
[INFO] hudi-common ........................................ SKIPPED
[INFO] hudi-timeline-service .............................. SKIPPED
[INFO] hudi-hadoop-mr ..................................... SKIPPED
[INFO] hudi-client ........................................ SKIPPED
[INFO] hudi-hive .......................................... SKIPPED
[INFO] hudi-spark_2.11 .................................... SKIPPED
[INFO] hudi-utilities_2.11 ................................ SKIPPED
[INFO] hudi-cli ........................................... SKIPPED
[INFO] hudi-hadoop-mr-bundle .............................. SKIPPED
[INFO] hudi-hive-bundle ................................... SKIPPED
[INFO] hudi-spark-bundle_2.11 ............................. SKIPPED
[INFO] hudi-presto-bundle ................................. SKIPPED
[INFO] hudi-utilities-bundle_2.11 ......................... SKIPPED
[INFO] hudi-timeline-server-bundle ........................ SKIPPED
[INFO] hudi-hadoop-docker ................................. SKIPPED
[INFO] hudi-hadoop-base-docker ............................ SKIPPED
[INFO] hudi-hadoop-namenode-docker ........................ SKIPPED
[INFO] hudi-hadoop-datanode-docker ........................ SKIPPED
[INFO] hudi-hadoop-history-docker ......................... SKIPPED
[INFO] hudi-hadoop-hive-docker ............................ SKIPPED
[INFO] hudi-hadoop-sparkbase-docker ....................... SKIPPED
[INFO] hudi-hadoop-sparkmaster-docker ..................... SKIPPED
[INFO] hudi-hadoop-sparkworker-docker ..................... SKIPPED
[INFO] hudi-hadoop-sparkadhoc-docker ...................... SKIPPED
[INFO] hudi-hadoop-presto-docker .......................... SKIPPED
[INFO] hudi-integ-test 0.5.2-SNAPSHOT ..................... SKIPPED
[INFO] ------------------------------------------------------------------------
[INFO] BUILD FAILURE
[INFO] ------------------------------------------------------------------------
[INFO] Total time: 4.676 s
[INFO] Finished at: 2020-01-22T03:39:17Z
[INFO] ------------------------------------------------------------------------
[ERROR] Failed to execute goal org.apache.maven.plugins:maven-gpg-plugin:1.4:sign (sign-artifacts)
on project hudi: Exit code: 2 -> [Help 1]
[ERROR] 
[ERROR] To see the full stack trace of the errors, re-run Maven with the -e switch.
[ERROR] Re-run Maven using the -X switch to enable full debug logging.
[ERROR] 
[ERROR] For more information about the errors and possible solutions, please read the following
articles:
[ERROR] [Help 1] http://cwiki.apache.org/confluence/display/MAVEN/MojoExecutionException
Build step 'Execute shell' marked build as failure
Setting MAVEN_3_5_4_HOME=/home/jenkins/tools/maven/apache-maven-3.5.4

Mime
View raw message