httpd-users mailing list archives

Site index · List index
Message view « Date » · « Thread »
Top « Date » · « Thread »
From daulat khan <>
Subject [users@httpd] apache configuration error
Date Mon, 01 Feb 2010 15:33:23 GMT

i am hitting with this error while configuring apache httpd-2.2.14 in
solaris 10 machine

checking pthread.h presence... yes
configure: WARNING: pthread.h: present but cannot be compiled

and while running make it produces this error.

/usr/ucbinclude/sys/file.h:156:20: macro "lseek" requires 3 arguments,
but only 1 given
In file included from file_io/unix/flock.c:23:
/usr/ucbinclude/sys/file.h:156: error: `lseek' redeclared as different
kind of symbol
/usr/ucbinclude/unistd.h:156: error: previous declaration of `lseek'
make-3.79.1-p7[3]: *** [file_io/unix/flock.lo] Error 1
make-3.79.1-p7[3]: Leaving directory `/opt/dasyedib/httpd-2.2.14/srclib/apr'
make-3.79.1-p7[2]: *** [all-recursive] Error 1
make-3.79.1-p7[2]: Leaving directory `/opt/dasyedib/httpd-2.2.14/srclib/apr'
make-3.79.1-p7[1]: *** [all-recursive] Error 1
make-3.79.1-p7[1]: Leaving directory `/opt/dasyedib/httpd-2.2.14/srclib'
make-3.79.1-p7: *** [all-recursive] Error 1

Please help.


The official User-To-User support forum of the Apache HTTP Server Project.
See <URL:> for more info.
To unsubscribe, e-mail:
   "   from the digest:
For additional commands, e-mail:

View raw message