httpd-users mailing list archives

Site index · List index
Message view « Date » · « Thread »
Top « Date » · « Thread »
From Ihsan Dogan <ih...@dogan.ch>
Subject [users@httpd] Strange compile problem on Solaris (sparc)
Date Sat, 27 Dec 2008 23:35:12 GMT
Hello,

I'm trying to build Apache for opencsw.org using the opencsw.org
OpenLDAP libraries. During the compile, I'm getting this error:

/bin/bash
/home/ihsan/gar/csw/mgar/pkg/apache2/trunk/work/ihsan-build8s.d/httpd-2.2.11/srclib/apr/libtool
--silent --mode=compile cc -mt  -DSSL_EXPERIMENTAL -DSSL_ENGINE -xO3
-xtarget=ultra -xarch=v8
-I/home/ihsan/build/build.5.8-sparc/opt/csw/include
-I/opt/csw/bdb44/include -I/opt/csw/include  -DHAVE_CONFIG_H
-I/home/ihsan/build/build.5.8-sparc/opt/csw/include
-I/opt/csw/bdb44/include -I/opt/csw/include -DSOLARIS2=8
-D_POSIX_PTHREAD_SEMANTICS -D_REENTRANT -D_LARGEFILE64_SOURCE
-I/home/ihsan/build/build.5.8-sparc/opt/csw/include
-I/opt/csw/bdb44/include -I/opt/csw/include
-I/home/ihsan/gar/csw/mgar/pkg/apache2/trunk/work/ihsan-build8s.d/httpd-2.2.11/srclib/apr-util/include
-I/home/ihsan/gar/csw/mgar/pkg/apache2/trunk/work/ihsan-build8s.d/httpd-2.2.11/srclib/apr-util/include/private
-I/opt/csw/include
-I/home/ihsan/gar/csw/mgar/pkg/apache2/trunk/work/ihsan-build8s.d/httpd-2.2.11/srclib/apr/include
 -I/opt/csw/bdb44/include -I/opt/csw/include  -o ldap/apr_ldap_stub.lo
-c ldap/apr_ldap_stub.c && touch ldap/apr_ldap_stub.lo
"/home/ihsan/gar/csw/mgar/pkg/apache2/trunk/work/ihsan-build8s.d/httpd-2.2.11/srclib/apr-util/include/apr_ldap.h",
line 132: #error: Support for LDAP v2.0 toolkits has been removed from
apr-util. Please use an LDAP v3.0 toolkit.
cc: acomp failed for ldap/apr_ldap_stub.c
gmake[4]: *** [ldap/apr_ldap_stub.lo] Error 1
gmake[4]: Leaving directory
`/home/ihsan/gar/csw/mgar/pkg/apache2/trunk/work/ihsan-build8s.d/httpd-2.2.11/srclib/apr-util'
gmake[3]: *** [all-recursive] Error 1
gmake[3]: Leaving directory
`/home/ihsan/gar/csw/mgar/pkg/apache2/trunk/work/ihsan-build8s.d/httpd-2.2.11/srclib/apr-util'
gmake[2]: *** [all-recursive] Error 1
gmake[2]: Leaving directory
`/home/ihsan/gar/csw/mgar/pkg/apache2/trunk/work/ihsan-build8s.d/httpd-2.2.11/srclib'
gmake[1]: *** [all-recursive] Error 1
gmake[1]: Leaving directory
`/home/ihsan/gar/csw/mgar/pkg/apache2/trunk/work/ihsan-build8s.d/httpd-2.2.11'

I've noticed that someone else had this [1] problem as well, but there
was no solution to this.

Any idea, what is going wrong here?

[1] http://article.gmane.org/gmane.comp.apache.user/78115




Ihsan


-- 
ihsan@dogan.ch		http://blog.dogan.ch/

---------------------------------------------------------------------
The official User-To-User support forum of the Apache HTTP Server Project.
See <URL:http://httpd.apache.org/userslist.html> for more info.
To unsubscribe, e-mail: users-unsubscribe@httpd.apache.org
   "   from the digest: users-digest-unsubscribe@httpd.apache.org
For additional commands, e-mail: users-help@httpd.apache.org


Mime
View raw message