httpd-users mailing list archives

Site index · List index
Message view « Date » · « Thread »
Top « Date » · « Thread »
From Richard Luckhurst <>
Subject [users@httpd] Trouble Compiline httpd-2.2.3
Date Mon, 09 Oct 2006 08:04:00 GMT

I am trying to complie httpd-2.2.3 on a Fedora 5 Linix box and I am getting
errors. Below are is the error and the compiler output at the point the failure

/usr/local/apache2/build/libtool --silent --mode=link gcc -g -O2 -pthread
-L/usr/local/lib   -o htpasswd  htpasswd.lo
-lm /usr/local/pkg/httpd-2.2.3/srclib/pcre/ /usr/local/apache2/lib/
-lpq -lsqlite3 -lexpat /usr/local/apache2/lib/ -luuid -lrt -lcrypt -lpthread -ldl
/usr/bin/ld: cannot find -lpq
collect2: ld returned 1 exit status
make[2]: *** [htpasswd] Error 1
make[2]: Leaving directory `/usr/local/pkg/httpd-2.2.3/support'
make[1]: *** [all-recursive] Error 1
make[1]: Leaving directory `/usr/local/pkg/httpd-2.2.3/support'
make: *** [all-recursive] Error 1

I have compile this OK on a few other Fedora boxes without problems and this has
me stumped. Has anyone seen this error before?

Richard Luckhurst                      
Product Development
Exodus Systems - Sydney, Australia.
Tel: (+612) 4751-9633
Fax: (+612) 4751-9644
Exodus Systems - Smarter Systems, Better Business

The official User-To-User support forum of the Apache HTTP Server Project.
See <URL:> for more info.
To unsubscribe, e-mail:
   "   from the digest:
For additional commands, e-mail:

View raw message