httpd-users mailing list archives

Site index · List index
Message view « Date » · « Thread »
Top « Date » · « Thread »
From ziwei ds <zw_dou...@yahoo.com.sg>
Subject [users@httpd] Apache-1.3.33 compilation error
Date Sat, 02 Jul 2005 05:18:03 GMT
Hi,
 
I am compiling Apache-1..3.33 with the following options:
 
./configure --prefix=/var/apache1.3 --localstatedir=/home 
--enable-module=most --enable-shared=max
 
I have hit into the following error during 'make.
 
mod_auth_dbm.c:41:18: ndbm.h: No such file or directory
mod_auth_dbm.c: In function `get_dbm_pw':
mod_auth_dbm.c:109: `DBM' undeclared (first use in this function)
mod_auth_dbm.c:109: (Each undeclared identifier is reported only once
mod_auth_dbm.c:109: for each function it appears in.)
mod_auth_dbm.c:109: `f' undeclared (first use in this function)
mod_auth_dbm.c:110: `datum' undeclared (first use in this function)
mod_auth_dbm.c:110: syntax error before "d"
mod_auth_dbm.c:113: `q' undeclared (first use in this function)
mod_auth_dbm.c:127: `d' undeclared (first use in this function)
make[4]: *** [mod_auth_dbm.so] Error 1
make[3]: *** [all] Error 1
make[2]: *** [subdirs] Error 1
 
First, I thought I have missing gdbm-devel. However, the problem remain after I install the
gdbm-devel rpm.
 
Did anyone encounter the similar problem, what am I missing here?
 
Thanks & Regards,
Ziwei
 
 

Send instant messages to your online friends http://asia.messenger.yahoo.com 
Mime
View raw message