httpd-users mailing list archives

Site index · List index
Message view « Date » · « Thread »
Top « Date » · « Thread »
From "Klavs Klavsen" ...@vsen.dk>
Subject [users@httpd] Compiling apache-1.3.31 on Red Hat 6.2 fails
Date Tue, 25 May 2004 16:04:27 GMT
Hi guys,

I needed to upgrade apache on a Red Hat 6.2 host. It was running apache
1.3.22 :(

When I try to compile my spec-file (which compiles fine on RH72) i get this:

[SNIP]
In file included from ../include/ap_config.h:1136,
                 from ap_base64.c:24:
/usr/include/signal.h:303: warning: `struct sigcontext' declared inside
parameter list
/usr/include/signal.h:303: warning: its scope is only this definition or
declaration,
/usr/include/signal.h:303: warning: which is probably not what you want.
gcc -c  -I../os/unix -I../include   -DLINUX=22 -DHAVE_SET_DUMPABLE
-I/usr/include/db1 -DUSE_HSREGEX `../apaci` ap_ebcdic.c
In file included from ../include/ap_config.h:1136,
                 from ../include/httpd.h:29,
                 from ap_ebcdic.c:16:
/usr/include/signal.h:303: warning: `struct sigcontext' declared inside
parameter list
/usr/include/signal.h:303: warning: its scope is only this definition or
declaration,
/usr/include/signal.h:303: warning: which is probably not what you want.
gcc -c  -I../os/unix -I../include   -DLINUX=22 -DHAVE_SET_DUMPABLE
-I/usr/include/db1 -DUSE_HSREGEX `../apaci` ap_strtol.c
In file included from ../include/ap_config.h:1136,
                 from ../include/httpd.h:29,
                 from ap_strtol.c:49:
/usr/include/signal.h:303: warning: `struct sigcontext' declared inside
parameter list
/usr/include/signal.h:303: warning: its scope is only this definition or
declaration,
/usr/include/signal.h:303: warning: which is probably not what you want.
ap_strtol.c: In function `ap_strtol':
ap_strtol.c:170: `ERANGE' undeclared (first use in this function)
ap_strtol.c:170: (Each undeclared identifier is reported only once
ap_strtol.c:170: for each function it appears in.)
ap_strtol.c:174: `EINVAL' undeclared (first use in this function)
make[3]: *** [ap_strtol.o] Error 1
make[2]: *** [subdirs] Error 1
make[2]: Leaving directory `/usr/src/redhat/BUILD/apache_1.3.31/src'
make[1]: *** [build-std] Error 2
make[1]: Leaving directory `/usr/src/redhat/BUILD/apache_1.3.31'
make: *** [build] Error 2
error: Bad exit status from /var/tmp/rpm-tmp.81978 (%build)

Any suggestions as to how I could relieve this? Unfortunately a lot of
stuff runs on the machine that can't just be moved - as its dependent on
perl-modules in certain versions which can't just be found again - and
thus can't be recompiled to newer distro version etc. ie. a whole lot of
work :(

-- 
Regards,
Klavs Klavsen, GSEC - kl@vsen.dk - http://www.vsen.dk
PGP: 7E063C62/2873 188C 968E 600D D8F8  B8DA 3D3A 0B79 7E06 3C62

"Those who do not understand Unix are condemned to reinvent it, poorly."
  --Henry Spencer


---------------------------------------------------------------------
The official User-To-User support forum of the Apache HTTP Server Project.
See <URL:http://httpd.apache.org/userslist.html> for more info.
To unsubscribe, e-mail: users-unsubscribe@httpd.apache.org
   "   from the digest: users-digest-unsubscribe@httpd.apache.org
For additional commands, e-mail: users-help@httpd.apache.org


Mime
View raw message