httpd-users mailing list archives

Site index · List index
Message view « Date » · « Thread »
Top « Date » · « Thread »
From Pieter Donche <>
Subject [users@httpd] Apache 1.3.29 Segmentation fault
Date Thu, 08 Jan 2004 14:21:50 GMT

I have SUN Ultra Enterprise 2170 with Solaris 2.8, GNU cc compiler 3.2

I am trying to make apache-1.3.29 with PHP4 and JServ
PHP 4.3.4 was configured:
# ./configure --with-apache=/home/wins/builds/src/other/apache_1.3.29 \
              --with-gd \
              --with-jpeg-dir=/usr/local \
              --with-png-dir=/usr/local \
              --with-zlib-dir=/usr/local \
              --with-informix=/home/informix2000 \
              --with-ldap=/usr/local \
              --enable-xslt \
              --with-xslt-sablot \

and make'd and make install'ed succesfully

JServ-1.1.2 was configured:
# ./configure  --prefix=/usr/local/jserv --with-apache-src=/home/wins/builds/src/other/apache_1.3.29
--with-jdk-home=/usr/java --with-JSDK=/usr/apache/libexec/jsdk.jar

and make'd and make install'ed succesfully

Apache-1.3.29 was configured:
# ./configure \
  --prefix=/home/apache_1329 \
  --activate-module=src/modules/php4/libphp4.a \

make'ing gives:
rm -f libap.a
ar cr libap.a ap_cpystrn.o ap_execve.o ap_fnmatch.o ap_getpass.o ap_md5c.o ap_signal.o ap_slack.o
ap_snprintf.o ap_sha1.o ap_checkpass.o ap_base64.o ap_ebcdic.o ap_strtol.o
ranlib libap.a
<=== src/ap
===> src/main
gcc -c  -I../os/unix -I../include   -DSOLARIS2=280 -DNO_DL_NEEDED `../apaci` gen_test_char.c
gcc  -DSOLARIS2=280 -DNO_DL_NEEDED `../apaci`   -o gen_test_char gen_test_char.o  -Lmodules/jserv
-L../modules/jserv -L../../modules/jserv -ljserv  -R/usr/ucblib -R/usr/local/lib/gcc-lib/sparc-sun-solaris2.9/3.2
-R/usr/local/lib -R/home/informix2000/lib -R/home/informix2000/lib/esql -R/home/wins/builds/src/other/php-4.3.4/ext/informix
 -L/usr/ucblib -L/usr/local/lib/gcc-lib/sparc-sun-solaris2.9/3.2 -L/usr/local/lib -L/home/informix2000/lib
-L/home/informix2000/lib/esql -L/home/wins/builds/src/other/php-4.3.4/ext/informix -Lmodules/php4
-L../modules/php4 -L../../modules/php4 -lmodphp4    -L/usr/ucblib -L/usr/local/lib/gcc-lib/sparc-sun-solaris2.9/3.2
-L/usr/local/lib -L/home/informix2000/lib -L/home/informix2000/lib/esql -L/home/wins/builds/src/other/php-4.3.4/ext/informix
  -lifsql -lifasf -lifgen -lifos -lifgls -lnsl -lsocket -laio -ldl -lelf -lphpifx -lifglx
-lnsl -lldap -llber -lpng -lz -ljpeg -lz -lresolv -lm -lsocket  -lgcc   -lsocket -lnsl -lpthread
./gen_test_char >test_char.h
Segmentation Fault
make[3]: *** [test_char.h] Error 139
make[2]: *** [subdirs] Error 1
make[2]: Leaving directory `/home/wins/builds/src/other/apache_1.3.29/src'
make[1]: *** [build-std] Error 2
make[1]: Leaving directory `/home/wins/builds/src/other/apache_1.3.29'
make: *** [build] Error 2

Anyone any idea what might be going wrong here ?

Thanks for any help of hint

 / Pieter Donche \____________________________________________
 | ITC Manager                  e-mail \
 | Dept. Mathem. & Computer Science, University of Antwerp    |
 | (UA) Middelheimlaan 1, B 2020 Antwerpen,      BELGIUM (EU) |
 | room G1.16,      tel +32 03.265.3870, fax +32 03.265.3777  |

The official User-To-User support forum of the Apache HTTP Server Project.
See <URL:> for more info.
To unsubscribe, e-mail:
   "   from the digest:
For additional commands, e-mail:

View raw message