httpd-users mailing list archives

Site index · List index
Message view « Date » · « Thread »
Top « Date » · « Thread »
From "Leif W" <warp-...@usa.net>
Subject Re: [users@httpd] Unable to run make. HELP!!!
Date Tue, 07 Oct 2003 20:50:09 GMT

> In file included from cryptlib.c:59:
> /usr/local/lib/gcc-lib/sparc-sun-solaris2.8/3.3/include/stdio.h:36:27:
iso/stdio_iso.h: No such file or directory

Looking at this, it looks like stdio.h is broken?  Maybe it's a broken gcc
install?  Can you compile anything at all?  Have you tried writing a simple
"Hello World" program in C and include the stdio.h file, and see if you can
compile that?  It's been a while since I've touched any C, or had to
configure a broken compiler, so I might not be of much help beyond flagging
the problem, but it looks like a more basic problem like gcc, not make, so
rule that out first before proceeding.

Leif

----- Original Message ----- 
From: Saunders Jack
To: users@httpd.apache.org
Sent: Tuesday, October 07, 2003 4:21 PM
Subject: [users@httpd] Unable to run make. HELP!!!


We have upgraded our unix server from Solaris 6 to 8.  We are attempting to
recompile apache with ssl support, however now we are unable to run make
without a ton of errors.  We have upgraded to  make version 3.8 , gcc
version 3.3, and perl 5 but we have the same results.  Below is the error
output.  Any help would be greatly appreciated!  Make was working prior to
the upgrade.  Thanks!

/export/home/appladm/install/openssl-0.9.6k> make
+ rm -f libcrypto.so.0
+ rm -f libcrypto.so
+ rm -f libcrypto.so.0.9.6
+ rm -f libssl.so.0
+ rm -f libssl.so
+ rm -f libssl.so.0.9.6
making all in crypto...
( echo "#ifndef MK1MF_BUILD"; \
echo ' /* auto-generated by crypto/Makefile.ssl for crypto/cversion.c */'; \
echo ' #define CFLAGS
"gcc -fPIC -DTHREADS -D_REENTRANT -DDSO_DLFCN -DHAVE_DLFCN_H -fPIC -mcpu=ult
rasparc -O3
-fomit-frame-pointer -Wall -DB_ENDIAN -DBN_DIV2W -DULTRASPARC -DMD5_ASM"'; \
echo ' #define PLATFORM "solaris-sparcv9-gcc"'; \
echo " #define DATE \"`LC_ALL=C LC_TIME=C date`\""; \
echo '#endif' ) >buildinf.h
gcc -I. -I../include -fPIC -DTHREADS -D_REENTRANT -DDSO_DLFCN -DHAVE_DLFCN_H
 -fPIC -mcpu=ultrasparc -O3 -fomit
-frame-pointer -Wall -DB_ENDIAN -DBN_DIV2W -DULTRASPARC -DMD5_ASM -c -o
cryptlib.o cryptlib.c
In file included from cryptlib.c:59:
/usr/local/lib/gcc-lib/sparc-sun-solaris2.8/3.3/include/stdio.h:36:27:
iso/stdio_iso.h: No such file or direct
ory
In file included from cryptlib.c:59:
/usr/local/lib/gcc-lib/sparc-sun-solaris2.8/3.3/include/stdio.h:194: error:
parse error before '*' token
/usr/local/lib/gcc-lib/sparc-sun-solaris2.8/3.3/include/stdio.h:229: error:
parse error before '*' token
/usr/local/lib/gcc-lib/sparc-sun-solaris2.8/3.3/include/stdio.h:230: error:
parse error before '*' token
/usr/local/lib/gcc-lib/sparc-sun-solaris2.8/3.3/include/stdio.h:236: error:
parse error before "size_t"
/usr/local/lib/gcc-lib/sparc-sun-solaris2.8/3.3/include/stdio.h:241: error:
parse error before "size_t"
/usr/local/lib/gcc-lib/sparc-sun-solaris2.8/3.3/include/stdio.h:250: error:
parse error before '*' token
/usr/local/lib/gcc-lib/sparc-sun-solaris2.8/3.3/include/stdio.h:252: error:
parse error before '*' token
/usr/local/lib/gcc-lib/sparc-sun-solaris2.8/3.3/include/stdio.h:261: error:
parse error before '*' token
/usr/local/lib/gcc-lib/sparc-sun-solaris2.8/3.3/include/stdio.h:262: error:
parse error before '*' token
/usr/local/lib/gcc-lib/sparc-sun-solaris2.8/3.3/include/stdio.h:263: error:
parse error before '*' token
/usr/local/lib/gcc-lib/sparc-sun-solaris2.8/3.3/include/stdio.h:264: error:
parse error before '*' token
/usr/local/lib/gcc-lib/sparc-sun-solaris2.8/3.3/include/stdio.h:266: error:
parse error before "FILE"
/usr/local/lib/gcc-lib/sparc-sun-solaris2.8/3.3/include/stdio.h:276: error:
parse error before '*' token
/usr/local/lib/gcc-lib/sparc-sun-solaris2.8/3.3/include/stdio.h:285: error:
parse error before '*' token
/usr/local/lib/gcc-lib/sparc-sun-solaris2.8/3.3/include/stdio.h:286: error:
parse error before "FILE"
/usr/local/lib/gcc-lib/sparc-sun-solaris2.8/3.3/include/stdio.h:287: error:
parse error before '*' token
cryptlib.c:60:20: string.h: No such file or directory
cryptlib.c:61:20: assert.h: No such file or directory
In file included from cryptlib.c:62:
cryptlib.h:62:20: stdlib.h: No such file or directory
cryptlib.h:63:20: string.h: No such file or directory
In file included from cryptlib.h:65,
from cryptlib.c:62:
../include/openssl/e_os.h:293:30: unistd.h: No such file or directory
In file included from ../include/openssl/e_os.h:298,
from cryptlib.h:65,
from cryptlib.c:62:
/usr/local/lib/gcc-lib/sparc-sun-solaris2.8/3.3/include/sys/types.h:27:26:
sys/isa_defs.h: No such file or dir
ectory
/usr/local/lib/gcc-lib/sparc-sun-solaris2.8/3.3/include/sys/types.h:28:31:
sys/feature_tests.h: No such file o
r directory
/usr/local/lib/gcc-lib/sparc-sun-solaris2.8/3.3/include/sys/types.h:33:27:
sys/machtypes.h: No such file or di
rectory
/usr/local/lib/gcc-lib/sparc-sun-solaris2.8/3.3/include/sys/types.h:45:27:
sys/int_types.h: No such file or di
rectory
In file included from ../include/openssl/e_os.h:298,
from cryptlib.h:65,
from cryptlib.c:62:
/usr/local/lib/gcc-lib/sparc-sun-solaris2.8/3.3/include/sys/types.h:210:
error: parse error before "pad64_t"
/usr/local/lib/gcc-lib/sparc-sun-solaris2.8/3.3/include/sys/types.h:211:
error: parse error before "upad64_t"
/usr/local/lib/gcc-lib/sparc-sun-solaris2.8/3.3/include/sys/types.h:371:
error: parse error before "uint16_t"
/usr/local/lib/gcc-lib/sparc-sun-solaris2.8/3.3/include/sys/types.h:373:
error: parse error before "__pthread_
mutex_ceiling"
/usr/local/lib/gcc-lib/sparc-sun-solaris2.8/3.3/include/sys/types.h:374:
error: parse error before "__pthread_
mutex_type"
/usr/local/lib/gcc-lib/sparc-sun-solaris2.8/3.3/include/sys/types.h:378:
error: parse error before "uint8_t"
/usr/local/lib/gcc-lib/sparc-sun-solaris2.8/3.3/include/sys/types.h:380:
error: parse error before "__pthread_
mutex_owner64"
/usr/local/lib/gcc-lib/sparc-sun-solaris2.8/3.3/include/sys/types.h:382:
error: parse error before "__pthread_
mutex_data"
/usr/local/lib/gcc-lib/sparc-sun-solaris2.8/3.3/include/sys/types.h:387:
error: parse error before "uint8_t"
/usr/local/lib/gcc-lib/sparc-sun-solaris2.8/3.3/include/sys/types.h:390:
error: parse error before "__pthread_
cond_data"
/usr/local/lib/gcc-lib/sparc-sun-solaris2.8/3.3/include/sys/types.h:397:
error: parse error before "int32_t"
/usr/local/lib/gcc-lib/sparc-sun-solaris2.8/3.3/include/sys/types.h:399:
error: parse error before "__pthread_
rwlock_magic"
/usr/local/lib/gcc-lib/sparc-sun-solaris2.8/3.3/include/sys/types.h:400:
error: parse error before "__pthread_
rwlock_pad1"
/usr/local/lib/gcc-lib/sparc-sun-solaris2.8/3.3/include/sys/types.h:401:
error: parse error before "__pthread_
rwlock_pad2"
/usr/local/lib/gcc-lib/sparc-sun-solaris2.8/3.3/include/sys/types.h:402:
error: parse error before "__pthread_
rwlock_pad3"
/usr/local/lib/gcc-lib/sparc-sun-solaris2.8/3.3/include/sys/types.h:403:
error: parse error before '}' token
/usr/local/lib/gcc-lib/sparc-sun-solaris2.8/3.3/include/sys/types.h:432:
error: parse error before "upad64_t"
/usr/local/lib/gcc-lib/sparc-sun-solaris2.8/3.3/include/sys/types.h:569:24:
sys/select.h: No such file or dire
ctory
In file included from cryptlib.h:67,
from cryptlib.c:62:
../include/openssl/crypto.h:62:20: stdlib.h: No such file or directory
In file included from cryptlib.h:67,
from cryptlib.c:62:
../include/openssl/crypto.h:383: error: parse error before '*' token
In file included from cryptlib.h:69,
from cryptlib.c:62:
../include/openssl/bio.h:507: error: parse error before '*' token
In file included from cryptlib.h:70,
from cryptlib.c:62:
../include/openssl/err.h:64:20: stdlib.h: No such file or directory
In file included from ../include/openssl/err.h:71,
from cryptlib.h:70,
from cryptlib.c:62:
../include/openssl/lhash.h:134: error: parse error before "FILE"
../include/openssl/lhash.h:135: error: parse error before "FILE"
../include/openssl/lhash.h:136: error: parse error before "FILE"
../include/openssl/err.h:90:19: errno.h: No such file or directory
In file included from cryptlib.h:70,
from cryptlib.c:62:
../include/openssl/err.h:252: error: parse error before '*' token
cryptlib.c:113: error: `NULL' undeclared here (not in a function)
cryptlib.c:118: error: `NULL' undeclared here (not in a function)
cryptlib.c:122: error: `NULL' undeclared here (not in a function)
cryptlib.c:124: error: `NULL' undeclared here (not in a function)
cryptlib.c:125: error: `NULL' undeclared here (not in a function)
cryptlib.c:127: error: `NULL' undeclared here (not in a function)
cryptlib.c:129: error: `NULL' undeclared here (not in a function)
cryptlib.c:131: error: `NULL' undeclared here (not in a function)
cryptlib.c: In function `CRYPTO_get_new_lockid':
cryptlib.c:146: error: `NULL' undeclared (first use in this function)
cryptlib.c:146: error: (Each undeclared identifier is reported only once
cryptlib.c:146: error: for each function it appears in.)
cryptlib.c: In function `CRYPTO_get_new_dynlockid':
cryptlib.c:172: error: `NULL' undeclared (first use in this function)
cryptlib.c: In function `CRYPTO_destroy_dynlockid':
cryptlib.c:232: error: `NULL' undeclared (first use in this function)
cryptlib.c: In function `CRYPTO_get_dynlock_value':
cryptlib.c:275: error: `NULL' undeclared (first use in this function)
cryptlib.c: In function `CRYPTO_thread_id':
cryptlib.c:368: error: `NULL' undeclared (first use in this function)
cryptlib.c:377: warning: implicit declaration of function `getpid'
cryptlib.c: In function `CRYPTO_lock':
cryptlib.c:412: error: `NULL' undeclared (first use in this function)
cryptlib.c:417: warning: implicit declaration of function `assert'
cryptlib.c: In function `CRYPTO_add_lock':
cryptlib.c:434: error: `NULL' undeclared (first use in this function)
make: *** [cryptlib.o] Error 1
*** Error code 1
make: Fatal error: Command failed for target `sub_all'
smrp2:/export/home/appladm/install/openssl-0.9.6k> make > error.txt
+ rm -f libcrypto.so.0
+ rm -f libcrypto.so
+ rm -f libcrypto.so.0.9.6
+ rm -f libssl.so.0
+ rm -f libssl.so
+ rm -f libssl.so.0.9.6
In file included from cryptlib.c:59:
/usr/local/lib/gcc-lib/sparc-sun-solaris2.8/3.3/include/stdio.h:36:27:
iso/stdio_iso.h: No such file or direct
ory
In file included from cryptlib.c:59:
/usr/local/lib/gcc-lib/sparc-sun-solaris2.8/3.3/include/stdio.h:194: error:
parse error before '*' token
/usr/local/lib/gcc-lib/sparc-sun-solaris2.8/3.3/include/stdio.h:229: error:
parse error before '*' token
/usr/local/lib/gcc-lib/sparc-sun-solaris2.8/3.3/include/stdio.h:230: error:
parse error before '*' token
/usr/local/lib/gcc-lib/sparc-sun-solaris2.8/3.3/include/stdio.h:236: error:
parse error before "size_t"
/usr/local/lib/gcc-lib/sparc-sun-solaris2.8/3.3/include/stdio.h:241: error:
parse error before "size_t"
/usr/local/lib/gcc-lib/sparc-sun-solaris2.8/3.3/include/stdio.h:250: error:
parse error before '*' token
/usr/local/lib/gcc-lib/sparc-sun-solaris2.8/3.3/include/stdio.h:252: error:
parse error before '*' token
/usr/local/lib/gcc-lib/sparc-sun-solaris2.8/3.3/include/stdio.h:261: error:
parse error before '*' token
/usr/local/lib/gcc-lib/sparc-sun-solaris2.8/3.3/include/stdio.h:262: error:
parse error before '*' token
/usr/local/lib/gcc-lib/sparc-sun-solaris2.8/3.3/include/stdio.h:263: error:
parse error before '*' token
/usr/local/lib/gcc-lib/sparc-sun-solaris2.8/3.3/include/stdio.h:264: error:
parse error before '*' token
/usr/local/lib/gcc-lib/sparc-sun-solaris2.8/3.3/include/stdio.h:266: error:
parse error before "FILE"
/usr/local/lib/gcc-lib/sparc-sun-solaris2.8/3.3/include/stdio.h:276: error:
parse error before '*' token
/usr/local/lib/gcc-lib/sparc-sun-solaris2.8/3.3/include/stdio.h:285: error:
parse error before '*' token
/usr/local/lib/gcc-lib/sparc-sun-solaris2.8/3.3/include/stdio.h:286: error:
parse error before "FILE"
/usr/local/lib/gcc-lib/sparc-sun-solaris2.8/3.3/include/stdio.h:287: error:
parse error before '*' token
cryptlib.c:60:20: string.h: No such file or directory
cryptlib.c:61:20: assert.h: No such file or directory
In file included from cryptlib.c:62:
cryptlib.h:62:20: stdlib.h: No such file or directory
cryptlib.h:63:20: string.h: No such file or directory
In file included from cryptlib.h:65,
from cryptlib.c:62:
../include/openssl/e_os.h:293:30: unistd.h: No such file or directory
In file included from ../include/openssl/e_os.h:298,
from cryptlib.h:65,
from cryptlib.c:62:
/usr/local/lib/gcc-lib/sparc-sun-solaris2.8/3.3/include/sys/types.h:27:26:
sys/isa_defs.h: No such file or dir
ectory
/usr/local/lib/gcc-lib/sparc-sun-solaris2.8/3.3/include/sys/types.h:28:31:
sys/feature_tests.h: No such file o
r directory
/usr/local/lib/gcc-lib/sparc-sun-solaris2.8/3.3/include/sys/types.h:33:27:
sys/machtypes.h: No such file or di
rectory
/usr/local/lib/gcc-lib/sparc-sun-solaris2.8/3.3/include/sys/types.h:45:27:
sys/int_types.h: No such file or di
rectory
In file included from ../include/openssl/e_os.h:298,
from cryptlib.h:65,
from cryptlib.c:62:
/usr/local/lib/gcc-lib/sparc-sun-solaris2.8/3.3/include/sys/types.h:210:
error: parse error before "pad64_t"
/usr/local/lib/gcc-lib/sparc-sun-solaris2.8/3.3/include/sys/types.h:211:
error: parse error before "upad64_t"
/usr/local/lib/gcc-lib/sparc-sun-solaris2.8/3.3/include/sys/types.h:371:
error: parse error before "uint16_t"
/usr/local/lib/gcc-lib/sparc-sun-solaris2.8/3.3/include/sys/types.h:373:
error: parse error before "__pthread_
mutex_ceiling"
/usr/local/lib/gcc-lib/sparc-sun-solaris2.8/3.3/include/sys/types.h:374:
error: parse error before "__pthread_
mutex_type"
/usr/local/lib/gcc-lib/sparc-sun-solaris2.8/3.3/include/sys/types.h:378:
error: parse error before "uint8_t"
/usr/local/lib/gcc-lib/sparc-sun-solaris2.8/3.3/include/sys/types.h:380:
error: parse error before "__pthread_
mutex_owner64"
/usr/local/lib/gcc-lib/sparc-sun-solaris2.8/3.3/include/sys/types.h:382:
error: parse error before "__pthread_
mutex_data"
/usr/local/lib/gcc-lib/sparc-sun-solaris2.8/3.3/include/sys/types.h:387:
error: parse error before "uint8_t"
/usr/local/lib/gcc-lib/sparc-sun-solaris2.8/3.3/include/sys/types.h:390:
error: parse error before "__pthread_
cond_data"
/usr/local/lib/gcc-lib/sparc-sun-solaris2.8/3.3/include/sys/types.h:397:
error: parse error before "int32_t"
/usr/local/lib/gcc-lib/sparc-sun-solaris2.8/3.3/include/sys/types.h:399:
error: parse error before "__pthread_
rwlock_magic"
/usr/local/lib/gcc-lib/sparc-sun-solaris2.8/3.3/include/sys/types.h:400:
error: parse error before "__pthread_
rwlock_pad1"
/usr/local/lib/gcc-lib/sparc-sun-solaris2.8/3.3/include/sys/types.h:401:
error: parse error before "__pthread_
rwlock_pad2"
/usr/local/lib/gcc-lib/sparc-sun-solaris2.8/3.3/include/sys/types.h:402:
error: parse error before "__pthread_
rwlock_pad3"
/usr/local/lib/gcc-lib/sparc-sun-solaris2.8/3.3/include/sys/types.h:403:
error: parse error before '}' token
/usr/local/lib/gcc-lib/sparc-sun-solaris2.8/3.3/include/sys/types.h:432:
error: parse error before "upad64_t"
/usr/local/lib/gcc-lib/sparc-sun-solaris2.8/3.3/include/sys/types.h:569:24:
sys/select.h: No such file or dire
ctory
In file included from cryptlib.h:67,
from cryptlib.c:62:
making all in crypto...
gcc -I. -I../include -fPIC -DTHREADS -D_REENTRANT -DDSO_DLFCN -DHAVE_DLFCN_H
 -fPIC -mcpu=ultrasparc -O3 -fomit
smrp2:/export/home/appladm/install/openssl-0.9.6k> make
+ rm -f libcrypto.so.0
+ rm -f libcrypto.so
+ rm -f libcrypto.so.0.9.6
+ rm -f libssl.so.0
+ rm -f libssl.so
+ rm -f libssl.so.0.9.6
making all in crypto...
gcc -I. -I../include -fPIC -DTHREADS -D_REENTRANT -DDSO_DLFCN -DHAVE_DLFCN_H
 -fPIC -mcpu=ultrasparc -O3 -fomit
-frame-pointer -Wall -DB_ENDIAN -DBN_DIV2W -DULTRASPARC -DMD5_ASM -c -o
cryptlib.o cryptlib.c
In file included from cryptlib.c:59:
/usr/local/lib/gcc-lib/sparc-sun-solaris2.8/3.3/include/stdio.h:36:27:
iso/stdio_iso.h: No such file or direct
ory
In file included from cryptlib.c:59:
/usr/local/lib/gcc-lib/sparc-sun-solaris2.8/3.3/include/stdio.h:194: error:
parse error before '*' token
/usr/local/lib/gcc-lib/sparc-sun-solaris2.8/3.3/include/stdio.h:229: error:
parse error before '*' token
/usr/local/lib/gcc-lib/sparc-sun-solaris2.8/3.3/include/stdio.h:230: error:
parse error before '*' token
/usr/local/lib/gcc-lib/sparc-sun-solaris2.8/3.3/include/stdio.h:236: error:
parse error before "size_t"
/usr/local/lib/gcc-lib/sparc-sun-solaris2.8/3.3/include/stdio.h:241: error:
parse error before "size_t"
/usr/local/lib/gcc-lib/sparc-sun-solaris2.8/3.3/include/stdio.h:250: error:
parse error before '*' token
/usr/local/lib/gcc-lib/sparc-sun-solaris2.8/3.3/include/stdio.h:252: error:
parse error before '*' token
/usr/local/lib/gcc-lib/sparc-sun-solaris2.8/3.3/include/stdio.h:261: error:
parse error before '*' token
/usr/local/lib/gcc-lib/sparc-sun-solaris2.8/3.3/include/stdio.h:262: error:
parse error before '*' token
/usr/local/lib/gcc-lib/sparc-sun-solaris2.8/3.3/include/stdio.h:263: error:
parse error before '*' token
/usr/local/lib/gcc-lib/sparc-sun-solaris2.8/3.3/include/stdio.h:264: error:
parse error before '*' token
/usr/local/lib/gcc-lib/sparc-sun-solaris2.8/3.3/include/stdio.h:266: error:
parse error before "FILE"
/usr/local/lib/gcc-lib/sparc-sun-solaris2.8/3.3/include/stdio.h:276: error:
parse error before '*' token
/usr/local/lib/gcc-lib/sparc-sun-solaris2.8/3.3/include/stdio.h:285: error:
parse error before '*' token
/usr/local/lib/gcc-lib/sparc-sun-solaris2.8/3.3/include/stdio.h:286: error:
parse error before "FILE"
/usr/local/lib/gcc-lib/sparc-sun-solaris2.8/3.3/include/stdio.h:287: error:
parse error before '*' token
cryptlib.c:60:20: string.h: No such file or directory
cryptlib.c:61:20: assert.h: No such file or directory
In file included from cryptlib.c:62:
cryptlib.h:62:20: stdlib.h: No such file or directory
cryptlib.h:63:20: string.h: No such file or directory
In file included from cryptlib.h:65,
from cryptlib.c:62:
../include/openssl/e_os.h:293:30: unistd.h: No such file or directory
In file included from ../include/openssl/e_os.h:298,
from cryptlib.h:65,
from cryptlib.c:62:
/usr/local/lib/gcc-lib/sparc-sun-solaris2.8/3.3/include/sys/types.h:27:26:
sys/isa_defs.h: No such file or dir
ectory
/usr/local/lib/gcc-lib/sparc-sun-solaris2.8/3.3/include/sys/types.h:28:31:
sys/feature_tests.h: No such file o
r directory
/usr/local/lib/gcc-lib/sparc-sun-solaris2.8/3.3/include/sys/types.h:33:27:
sys/machtypes.h: No such file or di
rectory
/usr/local/lib/gcc-lib/sparc-sun-solaris2.8/3.3/include/sys/types.h:45:27:
sys/int_types.h: No such file or di
rectory
In file included from ../include/openssl/e_os.h:298,
from cryptlib.h:65,
from cryptlib.c:62:
/usr/local/lib/gcc-lib/sparc-sun-solaris2.8/3.3/include/sys/types.h:210:
error: parse error before "pad64_t"
/usr/local/lib/gcc-lib/sparc-sun-solaris2.8/3.3/include/sys/types.h:211:
error: parse error before "upad64_t"
/usr/local/lib/gcc-lib/sparc-sun-solaris2.8/3.3/include/sys/types.h:371:
error: parse error before "uint16_t"
/usr/local/lib/gcc-lib/sparc-sun-solaris2.8/3.3/include/sys/types.h:373:
error: parse error before "__pthread_
mutex_ceiling"
/usr/local/lib/gcc-lib/sparc-sun-solaris2.8/3.3/include/sys/types.h:374:
error: parse error before "__pthread_
mutex_type"
/usr/local/lib/gcc-lib/sparc-sun-solaris2.8/3.3/include/sys/types.h:378:
error: parse error before "uint8_t"
/usr/local/lib/gcc-lib/sparc-sun-solaris2.8/3.3/include/sys/types.h:380:
error: parse error before "__pthread_
mutex_owner64"
/usr/local/lib/gcc-lib/sparc-sun-solaris2.8/3.3/include/sys/types.h:382:
error: parse error before "__pthread_
mutex_data"
/usr/local/lib/gcc-lib/sparc-sun-solaris2.8/3.3/include/sys/types.h:387:
error: parse error before "uint8_t"
/usr/local/lib/gcc-lib/sparc-sun-solaris2.8/3.3/include/sys/types.h:390:
error: parse error before "__pthread_
cond_data"
/usr/local/lib/gcc-lib/sparc-sun-solaris2.8/3.3/include/sys/types.h:397:
error: parse error before "int32_t"
/usr/local/lib/gcc-lib/sparc-sun-solaris2.8/3.3/include/sys/types.h:399:
error: parse error before "__pthread_
rwlock_magic"
/usr/local/lib/gcc-lib/sparc-sun-solaris2.8/3.3/include/sys/types.h:400:
error: parse error before "__pthread_
rwlock_pad1"
/usr/local/lib/gcc-lib/sparc-sun-solaris2.8/3.3/include/sys/types.h:401:
error: parse error before "__pthread_
rwlock_pad2"
/usr/local/lib/gcc-lib/sparc-sun-solaris2.8/3.3/include/sys/types.h:402:
error: parse error before "__pthread_
rwlock_pad3"
/usr/local/lib/gcc-lib/sparc-sun-solaris2.8/3.3/include/sys/types.h:403:
error: parse error before '}' token
/usr/local/lib/gcc-lib/sparc-sun-solaris2.8/3.3/include/sys/types.h:432:
error: parse error before "upad64_t"
/usr/local/lib/gcc-lib/sparc-sun-solaris2.8/3.3/include/sys/types.h:569:24:
sys/select.h: No such file or dire
ctory
In file included from cryptlib.h:67,
from cryptlib.c:62:
../include/openssl/crypto.h:62:20: stdlib.h: No such file or directory
In file included from cryptlib.h:67,
from cryptlib.c:62:
../include/openssl/crypto.h:383: error: parse error before '*' token
In file included from cryptlib.h:69,
from cryptlib.c:62:
../include/openssl/bio.h:507: error: parse error before '*' token
In file included from cryptlib.h:70,
from cryptlib.c:62:
../include/openssl/err.h:64:20: stdlib.h: No such file or directory
In file included from ../include/openssl/err.h:71,
from cryptlib.h:70,
from cryptlib.c:62:
../include/openssl/lhash.h:134: error: parse error before "FILE"
../include/openssl/lhash.h:135: error: parse error before "FILE"
../include/openssl/lhash.h:136: error: parse error before "FILE"
../include/openssl/err.h:90:19: errno.h: No such file or directory
In file included from cryptlib.h:70,
from cryptlib.c:62:
../include/openssl/err.h:252: error: parse error before '*' token
cryptlib.c:113: error: `NULL' undeclared here (not in a function)
cryptlib.c:118: error: `NULL' undeclared here (not in a function)
cryptlib.c:122: error: `NULL' undeclared here (not in a function)
cryptlib.c:124: error: `NULL' undeclared here (not in a function)
cryptlib.c:125: error: `NULL' undeclared here (not in a function)
cryptlib.c:127: error: `NULL' undeclared here (not in a function)
cryptlib.c:129: error: `NULL' undeclared here (not in a function)
cryptlib.c:131: error: `NULL' undeclared here (not in a function)
cryptlib.c: In function `CRYPTO_get_new_lockid':
cryptlib.c:146: error: `NULL' undeclared (first use in this function)
cryptlib.c:146: error: (Each undeclared identifier is reported only once
cryptlib.c:146: error: for each function it appears in.)
cryptlib.c: In function `CRYPTO_get_new_dynlockid':
cryptlib.c:172: error: `NULL' undeclared (first use in this function)
cryptlib.c: In function `CRYPTO_destroy_dynlockid':
cryptlib.c:232: error: `NULL' undeclared (first use in this function)
cryptlib.c: In function `CRYPTO_get_dynlock_value':
cryptlib.c:275: error: `NULL' undeclared (first use in this function)
cryptlib.c: In function `CRYPTO_thread_id':
cryptlib.c:368: error: `NULL' undeclared (first use in this function)
cryptlib.c:377: warning: implicit declaration of function `getpid'
cryptlib.c: In function `CRYPTO_lock':
cryptlib.c:412: error: `NULL' undeclared (first use in this function)
cryptlib.c:417: warning: implicit declaration of function `assert'
cryptlib.c: In function `CRYPTO_add_lock':
cryptlib.c:434: error: `NULL' undeclared (first use in this function)
make: *** [cryptlib.o] Error 1
*** Error code 1
make: Fatal error: Command failed for target `sub_all'



---------------------------------------------------------------------
The official User-To-User support forum of the Apache HTTP Server Project.
See <URL:http://httpd.apache.org/userslist.html> for more info.
To unsubscribe, e-mail: users-unsubscribe@httpd.apache.org
   "   from the digest: users-digest-unsubscribe@httpd.apache.org
For additional commands, e-mail: users-help@httpd.apache.org


Mime
View raw message