httpd-users mailing list archives

Site index · List index
Message view « Date » · « Thread »
Top « Date » · « Thread »
From "Cl. Yuri Huitron Alvarado" <>
Subject [users@httpd] Troubles compliling Apache 1.3.27 on Solaris 8 SPARC...
Date Fri, 21 Feb 2003 18:52:00 GMT
the configure was :

./configure --prefix=/www --enable-module=so

and displays the next message when I try to make Apache...

rm -f libap.a
ar cr libap.a ap_cpystrn.o ap_execve.o ap_fnmatch.o ap_getpass.o ap_md5c.o 
ap_signal.o ap_slack.o ap_snprintf.o ap_sha1.o ap_checkpass.o ap_base64.o 
ap_ebcdic.o ap_strtol.o
ranlib libap.a
<=== src/ap
===> src/main
gcc -c  -I../os/unix -I../include   -DSOLARIS2=280 `../apaci` gen_test_char.c
gcc  -DSOLARIS2=280 `../apaci`   -o gen_test_char gen_test_char.o  -lsocket -
lnsl -lpthread -lexpat -ldl
./gen_test_char >test_char.h ./gen_test_char: fatal: open failed: No such file or 
make[3]: *** [test_char.h] Error 137
make[2]: *** [subdirs] Error 1
make[2]: Leaving directory `/root/apache/apache_1.3.27/src'
make[1]: *** [build-std] Error 2
make[1]: Leaving directory `/root/apache/apache_1.3.27'
make: *** [build] Error 2

The official User-To-User support forum of the Apache HTTP Server Project.
See <URL:> for more info.
To unsubscribe, e-mail:
   "   from the digest:
For additional commands, e-mail:

View raw message