httpd-users mailing list archives

Site index · List index
Message view « Date » · « Thread »
Top « Date » · « Thread »
From "Sanjay Wadhwa" <SWAD...@indygov.org>
Subject Problem upgrading from Apache1.3.20 to Apache1.3.26
Date Thu, 20 Jun 2002 17:55:41 GMT
hi,

I am using the following to configure apache

$./configure --prefix=/usr/local/apache --enable-module=most
--enable-shared=max

when I do a make

I get 
$ make
===> src
make[1]: Entering directory `/home/swadhwa/apache_1.3.26'
make[2]: Entering directory `/home/swadhwa/apache_1.3.26/src'
===> src/regex
make[3]: Nothing to be done for `all'.
<=== src/regex
===> src/os/unix
gcc -c  -I../../os/unix -I../../include   -DLINUX=22 -I/usr/include/db1
-DUSE_HSREGEX `../../apaci` os.c
gcc -c  -I../../os/unix -I../../include   -DLINUX=22 -I/usr/include/db1
-DUSE_HSREGEX `../../apaci` os-inline.c
rm -f libos.a
ar cr libos.a os.o os-inline.o
ranlib libos.a
<=== src/os/unix
===> src/ap
gcc -c  -I../os/unix -I../include   -DLINUX=22 -I/usr/include/db1
-DUSE_HSREGEX`../apaci` ap_cpystrn.c
....
===> src/main
gcc -c  -I../os/unix -I../include   -DLINUX=22 -I/usr/include/db1
-DUSE_HSREGEX`../apaci` gen_test_char.c
gcc  -DLINUX=22 -I/usr/include/db1 -DUSE_HSREGEX `../apaci`   -o
gen_test_char gen_test_char.o  -lm -lcrypt -lndbm -lexpat -ldl
./gen_test_char >test_char.h
./gen_test_char: error in loading shared libraries: libexpat.so.0:
cannot open shared object file: No such file or directory
make[3]: *** [test_char.h] Error 127
make[2]: *** [subdirs] Error 1
make[2]: Leaving directory `/home/swadhwa/apache_1.3.26/src'
make[1]: *** [build-std] Error 2
make[1]: Leaving directory `/home/swadhwa/apache_1.3.26'


I checked my soure and libexpat.so is not there which used to be there
in 1.3.20 src

Any ideas...I need the DSO option,

HELP,

Sanjay



---------------------------------------------------------------------
To unsubscribe, e-mail: users-unsubscribe@httpd.apache.org
For additional commands, e-mail: users-help@httpd.apache.org


Mime
View raw message