httpd-users mailing list archives

Site index · List index
Message view « Date » · « Thread »
Top « Date » · « Thread »
From St├ęphane Rozes <Stephane.Ro...@Celsecat.com>
Subject Apache 1.3.26 Make Error
Date Mon, 24 Jun 2002 10:46:39 GMT
Hello,

I've downloaded the last Apache version 1.3.26 on a Linux Red Hat 7.1. When
I try to compile Apache with the following "configure" command :

./configure --prefix=/usr/local/www-public/www-chroot --disable-module=all -
-enable-module=so --enable-shared=access --enable-shared=alias --enable-shar
ed=dir --enable-shared=mime --enable-shared=log_config --enable-shared=autoi
ndex --enable-shared=cgi

I have the following "make" problem :

<=== src/modules/standard
<=== src/modules
gcc -c  -I./os/unix -I./include   -DLINUX=22 -DUSE_HSREGEX -DUSE_EXPAT -I./l
ib/expat-lite `./apaci` modules.c
gcc -c  -I./os/unix -I./include   -DLINUX=22 -DUSE_HSREGEX -DUSE_EXPAT -I./l
ib/expat-lite `./apaci` buildmark.c
gcc  -DLINUX=22 -DUSE_HSREGEX -DUSE_EXPAT -I./lib/expat-lite
/apaci`   -rdynamic \
      -o httpd buildmark.o modules.o modules/standard/libstandard.a
main/libmain.a ./os/unix/libos.a ap/libap.a regex/libregex.a
lib/expat-lite/libexpat.a  -lm -ldl
ap/libap.a(ap_checkpass.o): In function `ap_validate_password':
ap_checkpass.o(.text+0x94): undefined reference to `crypt'
collect2: ld returned 1 exit status
make[2]: *** [target_static] Error 1
make[2]: Leaving directory `/usr/local/apache_1.3.26/src'
make[1]: *** [build-std] Error 2
make[1]: Leaving directory `/usr/local/apache_1.3.26'
make: *** [build] Error 2

Do you have an idea about this problem ?

(before on the same machine an Apache version 1.3.14 worked correctly.)

Thank you for your help

Stephane Rozes



---------------------------------------------------------------------
To unsubscribe, e-mail: users-unsubscribe@httpd.apache.org
For additional commands, e-mail: users-help@httpd.apache.org


Mime
View raw message