httpd-users mailing list archives

Site index · List index
Message view « Date » · « Thread »
Top « Date » · « Thread »
Subject Install on Mac OS X - error on make
Date Tue, 30 Apr 2002 23:31:02 GMT

I am trying to install Apache httpd 2.0.35 on Mac OS X.

The config command ran successfully.
I ran make, and it ran for a while, but got this error at the end:

/usr/bin/ld: Undefined symbols:
make[2]: *** [htpasswd] Error 1
make[1]: *** [all-recursive] Error 1
make: *** [all-recursive] Error 1

I tried running "make install", and it also ran for a while and ended with
the same results.

Some of the directories have been installed (bin, build, include, lib,
modules), but there's no conf directory, and there is no apachectl in the
bin directory.


The official User-To-User support forum of the Apache HTTP Server Project.
See <URL:> for more info.
To unsubscribe, e-mail:
For additional commands, e-mail:

View raw message