httpd-users mailing list archives

Site index · List index
Message view « Date » · « Thread »
Top « Date » · « Thread »
From "Alex Blundell \(aj\)" <alexblund...@btinternet.com>
Subject error compiling
Date Fri, 11 Jan 2002 20:18:59 GMT
HI

Im compiling apache and when i typed make i got an error.

http_request.c
http_request.c: In function `get_path_info':
http_request.c:191: structure has no member named `execfilename'
http_request.c:191: structure has no member named `execfilename'
http_request.c: In function `directory_walk':
http_request.c:581: structure has no member named `execfilename'
http_request.c:581: structure has no member named `execfilename'
http_request.c:592: structure has no member named `execfilename'
http_request.c:592: structure has no member named `execfilename'
make[3]: *** [http_request.o] Error 1
make[2]: *** [subdirs] Error 1
make[2]: Leaving directory
`/download/Apachetoolbox-1.5.50/apache_1.3.22/src'
make[1]: *** [build-std] Error 2
make[1]: Leaving directory `/download/Apachetoolbox-1.5.50/apache_1.3.22'
make: *** [build] Error 2


please could you help me as ive tried almost everything.. thanks

AJ


---------------------------------------------------------------------
The official User-To-User support forum of the Apache HTTP Server Project.
See <URL:http://httpd.apache.org/userslist.html> for more info.
To unsubscribe, e-mail: users-unsubscribe@httpd.apache.org
For additional commands, e-mail: users-help@httpd.apache.org


Mime
View raw message