httpd-test-dev mailing list archives

Site index · List index
Message view « Date » · « Thread »
Top « Date » · « Thread »
From Stas Bekman <s...@stason.org>
Subject Re: [Fwd: FAIL Apache-Test-1.12 OpenBSD.i386-openbsd 3.5]
Date Tue, 29 Jun 2004 06:29:08 GMT
Geoffrey Young wrote:
> 
[...]
> waiting 60 seconds for server to start: .
> waiting 60 seconds for server to start: ok (waited 0 secs)
> server localhost.alianet:8529 started
> t/ping........# Failed test 3 in t/ping.t at line 16
> FAILED test 3
> 	Failed 1/3 tests, 66.67% okay
> t/redirect....# Failed test 4 in t/redirect.t at line 17
> # Failed test 6 in t/redirect.t at line 23
> FAILED tests 4, 6
> 	Failed 2/6 tests, 66.67% okay
> t/request.....# Failed test 1 in t/request.t at line 11
> # Failed test 5 in t/request.t at line 16
> # Failed test 8 in t/request.t at line 20
> # Failed test 9 in t/request.t at line 22
> FAILED tests 1, 5, 8-9
> 	Failed 4/9 tests, 55.56% okay
> Failed Test  Stat Wstat Total Fail  Failed  List of Failed
> -------------------------------------------------------------------------------
> t/ping.t                    3    1  33.33%  3
> t/redirect.t                6    2  33.33%  4 6
> t/request.t                 9    4  44.44%  1 5 8-9
> Failed 3/3 test scripts, 0.00% okay. 7/18 subtests failed, 61.11% okay.
> [  error] error running tests (please examine t/logs/error_log)
> +-----------------------------------------------------+
> | To report problems please refer to the SUPPORT file |
> +-----------------------------------------------------+
> *** Error code 1
> 
> Stop in /home/alian/.cpanplus/5.8.4/build/Apache-Test-1.12 (line 831 of
> Makefile).

error_log is missing.

-- 
__________________________________________________________________
Stas Bekman            JAm_pH ------> Just Another mod_perl Hacker
http://stason.org/     mod_perl Guide ---> http://perl.apache.org
mailto:stas@stason.org http://use.perl.org http://apacheweek.com
http://modperlbook.org http://apache.org   http://ticketmaster.com

Mime
View raw message