httpd-test-dev mailing list archives

Site index · List index
Message view « Date » · « Thread »
Top « Date » · « Thread »
From stephen chi zhang <schizh...@viator.com>
Subject Compiling error: flood_net.c:81: error: too many arguments to function `apr_socket_create'
Date Thu, 05 Feb 2004 04:31:16 GMT
I checkout the cvs and got the lastest flood code, everything goes fine 
untill the final make all is typed in. The error is
flood_net.c:81: warning: passing arg 4 of `apr_socket_create' makes 
pointer from integer without a cast
flood_net.c:81: error: too many arguments to function `apr_socket_create'
make: *** [flood_net.lo] Error 1

Then, make exits.
Anyone who knows how to solve this drop me a hint, please. Thanks in 
advance.

--
www.viator.com

Mime
View raw message