httpd-test-dev mailing list archives

Site index · List index
Message view « Date » · « Thread »
Top « Date » · « Thread »
From Jacek Prucia <jacek.pru...@acn.waw.pl>
Subject Re: Compiling error: flood_net.c:81: error: too many arguments to function `apr_socket_create'
Date Sun, 08 Feb 2004 19:54:06 GMT
On Thu, 05 Feb 2004 15:31:16 +1100
stephen chi zhang <schizhang@viator.com> wrote:

> I checkout the cvs and got the lastest flood code, everything goes fine 
> untill the final make all is typed in. The error is
> flood_net.c:81: warning: passing arg 4 of `apr_socket_create' makes 
> pointer from integer without a cast
> flood_net.c:81: error: too many arguments to function `apr_socket_create'
> make: *** [flood_net.lo] Error 1
> 
> Then, make exits.
> Anyone who knows how to solve this drop me a hint, please. Thanks in 
> advance.

I've just pulled out flood/apr/apr-util HEAD's from CVS, and everything
builds fine. Please check if flood build still fails for you. If this is the
case, then please post more details about your development enviroment (OS,
compiler, etc.)

regards,
Jacek Prucia





Mime
View raw message