httpd-packagers mailing list archives

Site index · List index
Message view « Date » · « Thread »
Top « Date » · « Thread »
From GavinW <gavin.willi...@card.co.uk>
Subject Unable to Build 2.2.11 RPM - /bin/sh: silent: command not found
Date Mon, 26 Jan 2009 14:27:37 GMT

When trying to build the Apache 2.2.11 source using rpmbuild, make failes
with the following error:

--
/rpmbuild/BUILD/httpd-2.2.11/srclib/pcre/get.c && touch get.lo
/bin/sh: silent: command not found
/bin/sh: silent: command not found
make[3]: [maketables.lo] Error 127 (ignored)
make[3]: [get.lo] Error 127 (ignored)
silent --mode=compile gcc   -O2 -g -pipe -Wall -Wp,-D_FORTIFY_SOURCE=2
-fexceptions -fstack-protector --param=ssp-buffer-size=4 -m64 -mtune=generic
-I/usr/kerberos/include     
-I/home/gavinw/rpmbuild/BUILD/httpd-2.2.11/prefork/srclib/pcre -I.
-I/home/gavinw/rpmbuild/BUILD/httpd-2.2.11/prefork/include
-I/home/gavinw/rpmbuild/BUILD/httpd-2.2.11/os/unix
-I/home/gavinw/rpmbuild/BUILD/httpd-2.2.11/server/mpm/prefork
-I/home/gavinw/rpmbuild/BUILD/httpd-2.2.11/modules/http
-I/home/gavinw/rpmbuild/BUILD/httpd-2.2.11/modules/filters
-I/home/gavinw/rpmbuild/BUILD/httpd-2.2.11/modules/proxy
-I/home/gavinw/rpmbuild/BUILD/httpd-2.2.11/include
-I/home/gavinw/rpmbuild/BUILD/httpd-2.2.11/modules/generators
-I/home/gavinw/rpmbuild/BUILD/httpd-2.2.11/modules/mappers
-I/home/gavinw/rpmbuild/BUILD/httpd-2.2.11/modules/database
-I/home/gavinw/rpmbuild/BUILD/httpd-2.2.11/modules/proxy/../generators
-I/home/gavinw/rpmbuild/BUILD/httpd-2.2.11/prefork/include
-I/usr/kerberos/include
-I/home/gavinw/rpmbuild/BUILD/httpd-2.2.11/modules/ssl
-I/home/gavinw/rpmbuild/BUILD/httpd-2.2.11/modules/dav/main   -c
/home/gavinw/rpmbuild/BUILD/httpd-2.2.11/srclib/pcre/study.c && touch
study.lo
silent --mode=compile gcc   -O2 -g -pipe -Wall -Wp,-D_FORTIFY_SOURCE=2
-fexceptions -fstack-protector --param=ssp-buffer-size=4 -m64 -mtune=generic
-I/usr/kerberos/include     
-I/home/gavinw/rpmbuild/BUILD/httpd-2.2.11/prefork/srclib/pcre -I.
-I/home/gavinw/rpmbuild/BUILD/httpd-2.2.11/prefork/include
-I/home/gavinw/rpmbuild/BUILD/httpd-2.2.11/os/unix
-I/home/gavinw/rpmbuild/BUILD/httpd-2.2.11/server/mpm/prefork
-I/home/gavinw/rpmbuild/BUILD/httpd-2.2.11/modules/http
-I/home/gavinw/rpmbuild/BUILD/httpd-2.2.11/modules/filters
-I/home/gavinw/rpmbuild/BUILD/httpd-2.2.11/modules/proxy
-I/home/gavinw/rpmbuild/BUILD/httpd-2.2.11/include
-I/home/gavinw/rpmbuild/BUILD/httpd-2.2.11/modules/generators
-I/home/gavinw/rpmbuild/BUILD/httpd-2.2.11/modules/mappers
-I/home/gavinw/rpmbuild/BUILD/httpd-2.2.11/modules/database
-I/home/gavinw/rpmbuild/BUILD/httpd-2.2.11/modules/proxy/../generators
-I/home/gavinw/rpmbuild/BUILD/httpd-2.2.11/prefork/include
-I/usr/kerberos/include
-I/home/gavinw/rpmbuild/BUILD/httpd-2.2.11/modules/ssl
-I/home/gavinw/rpmbuild/BUILD/httpd-2.2.11/modules/dav/main   -c
/home/gavinw/rpmbuild/BUILD/httpd-2.2.11/srclib/pcre/dftables.c && touch
dftables.lo
/bin/sh: silent: command not found
make[3]: [study.lo] Error 127 (ignored)
/bin/sh: silent: command not found
make[3]: [dftables.lo] Error 127 (ignored)
silent --mode=link gcc   -O2 -g -pipe -Wall -Wp,-D_FORTIFY_SOURCE=2
-fexceptions -fstack-protector --param=ssp-buffer-size=4 -m64 -mtune=generic
-I/usr/kerberos/include  
-L/home/gavinw/rpmbuild/BUILD/httpd-2.2.11/prefork/lib -L/usr/kerberos/lib64  
-o dftables -L/home/gavinw/rpmbuild/BUILD/httpd-2.2.11/prefork/lib
-L/usr/kerberos/lib64 dftables.lo -lm
make[3]: silent: Command not found
make[3]: [dftables] Error 127 (ignored)
./dftables /home/gavinw/rpmbuild/BUILD/httpd-2.2.11/srclib/pcre/chartables.c
make[3]: ./dftables: Command not found
make[3]: ***
[/home/gavinw/rpmbuild/BUILD/httpd-2.2.11/srclib/pcre/chartables.c] Error
127
make[3]: Leaving directory
`/home/gavinw/rpmbuild/BUILD/httpd-2.2.11/prefork/srclib/pcre'
make[2]: *** [all-recursive] Error 1
make[2]: Leaving directory
`/home/gavinw/rpmbuild/BUILD/httpd-2.2.11/prefork/srclib/pcre'
make[1]: *** [all-recursive] Error 1
make[1]: Leaving directory
`/home/gavinw/rpmbuild/BUILD/httpd-2.2.11/prefork/srclib'
make: *** [all-recursive] Error 1
error: Bad exit status from /home/gavinw/rpmbuild/tmp/rpm-tmp.2038 (%build)


RPM build errors:
    Bad exit status from /home/gavinw/rpmbuild/tmp/rpm-tmp.2038 (%build)
--

How do i get around this???

Cheers
Gavin
-- 
View this message in context: http://www.nabble.com/Unable-to-Build-2.2.11-RPM----bin-sh%3A-silent%3A-command-not-found-tp21666271p21666271.html
Sent from the Apache HTTP Server - Packagers mailing list archive at Nabble.com.


Mime
View raw message