httpd-dev mailing list archives

Site index · List index
Message view « Date » · « Thread »
Top « Date » · « Thread »
From Mario Brandt <jbl...@gmail.com>
Subject Re: httpd-2.3.9-alpha test tarballs
Date Tue, 23 Nov 2010 17:22:14 GMT
- 1
doesn't build on Win 7 x64 cause libhttpd doesn't build.



Mario

1>------ Build started: Project: libhttpd, Configuration: Release Win32 ------
1>Compiling...
1>util_mutex.c
1>.\server\util_mutex.c(151) : error C2440: 'function' : cannot
convert from 'apr_status_t (__stdcall *)(void *)' to 'apr_status_t
(__cdecl *)(void *)'
1>.\server\util_mutex.c(151) : warning C4024:
'apr_pool_cleanup_register' : different types for formal and actual
parameter 3
1>util_expr.c
1>c1 : fatal error C1083: Cannot open source file:
'.\server\util_expr.c': No such file or directory
1>log.c
1>.\server\log.c(452) : error C2440: 'function' : cannot convert from
'apr_status_t (__stdcall *)(void *)' to 'apr_status_t (__cdecl *)(void
*)'
1>.\server\log.c(452) : warning C4024: 'apr_pool_cleanup_register' :
different types for formal and actual parameter 3
1>.\server\log.c(1020) : warning C4018: '>' : signed/unsigned mismatch
1>config.c
1>.\server\config.c(480) : error C2440: 'function' : cannot convert
from 'apr_status_t (__stdcall *)(void *)' to 'apr_status_t (__cdecl
*)(void *)'
1>.\server\config.c(480) : warning C4024: 'apr_pool_cleanup_register'
: different types for formal and actual parameter 3
1>Generating Code...
1>Build log was saved at "file://c:\build\trunk\Release\BuildLog.htm"
1>libhttpd - 4 error(s), 4 warning(s)
========== Build: 4 succeeded, 1 failed, 0 up-to-date, 1 skipped ==========

Mime
View raw message