httpd-dev mailing list archives

Site index · List index
Message view « Date » · « Thread »
Top « Date » · « Thread »
From Graham Leggett <minf...@sharp.fm>
Subject Undefined symbols in ab.c
Date Sat, 03 Jan 2009 00:39:37 GMT
Hi all,

I am currently struggling to build httpd-trunk, the build of ab fails 
with undefined symbols as below. Is this broken for anyone else, or have 
I done something dumb?

/tmp/httpd-trunk//build-1/libtool --silent --mode=link gcc -g -Wall 
-Wmissing-prototypes -Wstrict-prototypes -Wmissing-declarations 
-I/opt/local/include 
-L/Users/minfrin/src/apache/sandbox/crypto/nss-3.12/mozilla/dist/Darwin9.4.0_OPT.OBJ/lib 
-L/usr/lib   -o ab  ab.lo   -L/opt/local/lib -lpcre             -lldap 
-llber                      -lz -lldap -llber                      -lssl 
-lcrypto                         /tmp/httpd-trunk//lib/libaprutil-1.la 
-lexpat -liconv /tmp/httpd-trunk//lib/libapr-1.la -lpthread -lssl -lcrypto
Undefined symbols:
   "_BIO_set_callback_arg", referenced from:
       _start_connect in ab.o
   "_BIO_get_callback_arg", referenced from:
       _ssl_print_cb in ab.o
   "_SSL_CTX_set_info_callback", referenced from:
       _main in ab.o
   "_BIO_set_callback", referenced from:
       _start_connect in ab.o
ld: symbol(s) not found
collect2: ld returned 1 exit status
make[2]: *** [ab] Error 1
make[1]: *** [install-recursive] Error 1
make: *** [install-recursive] Error 1

Regards,
Graham
--

Mime
View raw message