httpd-dev mailing list archives

Site index · List index
Message view « Date » · « Thread »
Top « Date » · « Thread »
From Rodent of Unusual Size <Ken.C...@Golux.Com>
Subject Re: perchild no compilee, includes tests failing
Date Sat, 24 Nov 2001 23:55:47 GMT
* On 2001-11-24 at 18:49,
  Rodent of Unusual Size <Ken.Coar@golux.com> excited the electrons to say:
> 
> I didn't get Ian's original message (?), but it looks as
> though 2.0.28 is failing the same includes tests.  Verifying
> now..

Yep, 2.0.28 is also failing some of the includes tests as they
currently exist in httpd-test/perl-framework.  However, those
are real failures, not protocol errors, so maybe Ryan's change
has something to do with it.

As far as that goes, notice that 2.0.28 fails some of the mod_cgi
subtests as well -- but only on the worker MPM; prefork seems
okey CGI-wise.

Only the work test output is listed below.

###Test: Platform: Linux 2.2.14-5.0 i686 unknown
###Test: Working with CVS revision APACHE_2_0_28
###Test: Building with ./configure options:
###Test:   --enable-auth-anon
###Test:   --enable-auth-digest
###Test:   --enable-case-filter
###Test:   --enable-case-filter-in
###Test:   --enable-cgi
###Test:   --enable-echo
###Test:   --enable-expires
###Test:   --enable-headers
###Test:   --enable-info
###Test:   --enable-maintainer-mode
###Test:   --enable-mime-magic
###Test:   --enable-optional-hook-export
###Test:   --enable-optional-hook-import
###Test:   --enable-rewrite
###Test:   --enable-speling
###Test:   --enable-unique-id
###Test:   --enable-usertrack
###Test:   --enable-vhost-alias
###Test:   --prefix=/tmp/ap2/server
###Test: Locking work area: done.
###Test: Checking out: httpd-2.0
###Test: Checking out: httpd-test
###Test: Disabling passbrigade test
###Test: Checking out: apr
###Test: Checking out: apr-util
###Test: Preprocessing: buildconf
###Test: Preprocessing: configure
###Test: Preprocessing: make distclean
###Test: MPM-Start: worker
###Test: configure
###Test: make
###Test: make install
###Test: make distclean
###Test: perl Makefile.PL
###Test: t/TEST -stop
###Test: t/TEST -clean
###Test: t/TEST -configure
###Test: Running tests
setting ulimit to allow core files
ulimit -c unlimited
 exec t/TEST 
/tmp/ap2/server/bin/httpd  -d /tmp/ap2/httpd-test/perl-framework/t -f /tmp/ap2/httpd-test/perl-framework/t/conf/httpd.conf
-DAPACHE2 
using Apache/2.0.28 (worker MPM)

waiting for server to start: 00:00
waiting for server to start: 00:01
waiting for server
to start: ok (waited 1 secs)
server localhost:8529 started
server localhost:8530 listening (mod_headers)
server localhost:8531 listening (mod_echo)
server localhost:8532 listening (mod_vhost_alias)
apache/404..........ok
apache/byterange....ok
apache/getfile......ok
apache/limits.......FAILED tests 9-10
	Failed 2/10 tests, 80.00% okay
apache/options......ok
apache/post.........ok
apache/rwrite.......ok
apr/uri.............ok
filter/case.........ok
filter/case_in......ok
filter/input_body...ok
http11/basicauth....ok
http11/chunked......ok
modules/access......ok
modules/alias.......ok
modules/autoindex...ok
modules/cgi.........FAILED tests 2, 4, 10, 12, 14, 16, 18, 20, 22, 24-27, 29-36
	Failed 21/36 tests, 41.67% okay
modules/dav.........skipped: cannot find module 'dav', cannot find module 'HTTP::DAV'
modules/dir.........ok
modules/env.........ok
modules/expires.....ok
modules/headers.....ok
modules/include.....FAILED tests 32-33, 39
	Failed 3/39 tests, 92.31% okay
modules/info........ok
modules/negotiation.ok
modules/rewrite.....ok
modules/setenvif....ok
modules/status......ok
modules/vhost_alias.ok
protocol/echo.......ok
protocol/nntp-like..skipped: cannot find module 'mod_ssl', cannot find module 'Net::SSL',
cannot find module 'mod_nntp_like'
ssl/all.............skipped: cannot find module 'mod_ssl', cannot find module 'LWP::Protocol::https'
Failed Test  Status Wstat Total Fail  Failed  List of failed
-------------------------------------------------------------------------------
apache/limits.t              10    2  20.00%  9-10
modules/cgi.t                36   21  58.33%  2, 4, 10, 12, 14, 16, 18, 20, 22,
                                              24-27, 29-36
modules/include              39    3   7.69%  32-33, 39
3 tests skipped.
server localhost:8529 shutdown
error running tests (please examine t/logs/error_log)
Failed 3/32 test scripts, 90.62% okay. 26/1893 subtests failed, 98.63% okay.
###Test: MPM-End: worker
###Test: Unlocking work area

-- 
#ken	P-)}

Ken Coar, Sanagendamgagwedweinini  http://Golux.Com/coar/
Author, developer, opinionist      http://Apache-Server.Com/

"All right everyone!  Step away from the glowing hamburger!"

Mime
View raw message