httpd-dev mailing list archives

Site index · List index
Message view « Date » · « Thread »
Top « Date » · « Thread »
From "MATHIHALLI,MADHUSUDAN (HP-Cupertino,ex1)" <madhusudan_mathiha...@hp.com>
Subject build fails with latest CVS
Date Tue, 21 Aug 2001 17:48:30 GMT
Hi,
	'not sure if I'm missing something here.. I downloaded the latest
CVS, configured using : 
./configure --prefix=/opt/apache2s --enable-dav=shared
--enable-dav_fs=shared \
        --enable-ssl --with-ssl=/opt/apache2s/ssl  \
        --enable-mods-shared=all --disable-auth_digest --disable-auth_db


And, I get the following error : 

Making all in ldap
make[3]: Entering directory
`/tmp_mnt/proj/middleware/madhum/PA/httpd-2.0/srclib/apr-util/ldap'
make[3]: *** No rule to make target `all'.  Stop.
make[3]: Leaving directory
`/tmp_mnt/proj/middleware/madhum/PA/httpd-2.0/srclib/apr-util/ldap'
make[2]: *** [all-recursive] Error 1
make[2]: Leaving directory
`/tmp_mnt/proj/middleware/madhum/PA/httpd-2.0/srclib/apr-util'
make[1]: *** [all-recursive] Error 1
make[1]: Leaving directory
`/tmp_mnt/proj/middleware/madhum/PA/httpd-2.0/srclib'
make: *** [all-recursive] Error 1


Help !!..

Thanks,
-Madhu

=> If this has been discussed in the list earlier, I'm sorry for posting it
again.. I haven't checked my e-mails over the last couple of days - I've
been working on other things.. 

Mime
View raw message