httpd-dev mailing list archives

Site index · List index
Message view « Date » · « Thread »
Top « Date » · « Thread »
From "Gomez Henri" <new-ht...@slib.fr>
Subject 2.0.24 and ssl and perchild
Date Sun, 26 Aug 2001 00:04:26 GMT
The problem I related previously appears only when using --with-mpm=perchild
No problem with threaded or worker

===>

ssl_engine_rand.c: In function `ssl_rand_seed':
ssl_engine_rand.c:154: `ap_scoreboard_image' undeclared (first use in this
function)
ssl_engine_rand.c:154: (Each undeclared identifier is reported only once
ssl_engine_rand.c:154: for each function it appears in.)
ssl_engine_rand.c:155: `SCOREBOARD_SIZE' undeclared (first use in this
function)
make[4]: *** [ssl_engine_rand.slo] Error 1
make[4]: Leaving directory `/usr/src/redhat/BUILD/httpd-2_0_24/modules/ssl'
make[3]: *** [shared-build-recursive] Error 1
make[3]: Leaving directory `/usr/src/redhat/BUILD/httpd-2_0_24/modules/ssl'
make[2]: *** [shared-build-recursive] Error 1
make[2]: Leaving directory `/usr/src/redhat/BUILD/httpd-2_0_24/modules'
make[1]: *** [shared-build-recursive] Error 1
make[1]: Leaving directory `/usr/src/redhat/BUILD/httpd-2_0_24'
make: *** [all-recursive] Error 1
Bad exit status from /var/tmp/rpm-tmp.81533 (%build)

<====

Any idea ?




Mime
View raw message