httpd-dev mailing list archives

Site index · List index
Message view « Date » · « Thread »
Top « Date » · « Thread »
From "Geoff Alexander" <gd...@us.ibm.com>
Subject Re: problem compiling apache_2.0a9
Date Thu, 08 Feb 2001 18:59:10 GMT
From: "William A. Rowe, Jr." <wrowe@covalent.net>
Date: Wed, 7 Feb 2001 15:50:54 -0800

> Yes - delete your test directories

Thanks for the reply.  It seems that the test directories are created by
configure, so I re-expanded apache_2.0a9.tar.gz and  tried

   ./buildconf
   ./configure
   rm -rf ./srclib/apr/test
   rm -rf ./srclib/apr-util/test
   rm -rf ./test
   make

Now I get the following from make:

   make[3]: Leaving directory
   `/root/install/Apache/apache_2.0a9/srclib/apr-util'
   Making all in test
   /bin/sh: cd: test: No such file or directory
   make[2]: *** [all-recursive] Error 1
   make[2]: Leaving directory
   `/root/install/Apache/apache_2.0a9/srclib/apr-util'
   make[1]: *** [all-recursive] Error 1
   make[1]: Leaving directory `/root/install/Apache/apache_2.0a9/srclib'
   make: *** [all-recursive] Error 1

It seems that I need to do something more than delete the test directories.

Thanks,
Geoff Alexander, Ph.D.
919/254-5216 T/L 444-5216
CMVC95 WebDAV Development
IBM Corporation
RTP, NC


Mime
View raw message