httpd-dev mailing list archives

Site index · List index
Message view « Date » · « Thread »
Top « Date » · « Thread »
From "William A. Rowe, Jr." <wr...@covalent.net>
Subject Re: problem compiling apache_2.0a9
Date Wed, 07 Feb 2001 23:50:54 GMT
From: "Geoff Alexander" <gdlxn@us.ibm.com>
Sent: Wednesday, February 07, 2001 2:52 PM

>    make[3]: Leaving directory
>    `/root/install/Apache/apache_2.0a9/srclib/apr-util'
>    Making all in test
>    make[3]: Entering directory
>    `/root/install/Apache/apache_2.0a9/srclib/apr-util/test'
>    make[3]: *** No rule to make target `all'.  Stop.
>    make[3]: Leaving directory
>    `/root/install/Apache/apache_2.0a9/srclib/apr-util/test'
>    make[2]: *** [all-recursive] Error 1
>    make[2]: Leaving directory
>    `/root/install/Apache/apache_2.0a9/srclib/apr-util'
>    make[1]: *** [all-recursive] Error 1
>    make[1]: Leaving directory `/root/install/Apache/apache_2.0a9/srclib'
>    make: *** [all-recursive] Error 1
> 
> Is this a known problem?  How do I compile apache_2.0a9?

Yes - delete your test directories



Mime
View raw message